{"text_format":"1","workbook":"xlsx","n_sheets":3,"sheets":["MASTER_EN","LIST","PARTS"],"not_rendered":{"charts":0,"images":0,"macros":1,"external_links":0,"defined_names":2,"comments":0,"pivot_tables":0},"unopened":[],"bounds":{"document_bytes":16777216,"sheet_cells":100000,"rows_first":2000,"rows_last":500,"rows_between":2000,"halvings":0,"cell_chars":16384,"cell_head_chars":4096},"cells_cut":0,"cells_raw":0,"read":"whole","date_system":"1900"}

{"sheet":"MASTER_EN","index":0,"n_rows":204,"n_cols":31,"rows_kept":204,"cut":false,"hidden":false,"merged":[[9,27,9,28],[122,6,122,11],[114,6,114,11],[7,6,7,11],[8,18,8,19],[9,18,9,19],[16,6,16,11],[21,6,21,11],[30,6,30,11],[52,6,52,11],[71,6,71,11],[84,6,84,11],[99,6,99,11],[107,6,107,11]]}
[null,null,null,null,null,null,null,null,null,null,null,null,null,null,null,null,null,null,null,null,null,null,null,null,"²"]
[null,null,null,null,null,null,null,null,null,null,null,null,null,null,null,null,null,"DATE REPAIR"]
[null,null,null,null,null,null,null,null,null,null,null,null,null,null,null,null,null,"INFO BIKE"]
[null,null,null,null,null,null,null,null,null,null,null,null,null,null,null,null,null,"BIN / FRAME N°"]
[null,null,null,null,null,null,null,null,null,null,null,null,null,null,null,null,null,"CLIENT NAME"]
[]
[null,null,null,null,null,null,null,null,null,null,null,null,null,null,null,null,null,null,null,null,null,null,null,null,null,null,null,"PRICE FOR","SP"]
[null,"1WU =",6,"min",null,null,"A. SUBMITTING THE BIKE FOR SERVICE",null,null,null,null,null,null,null,null,null,null,"OVERVIEW LABOR COST",null,null,null,null,null,null,null,"SPARE PARTS COST",null,"VAT RATE %"]
[null,"1WU COST =",7,null,null,"Lp","CODE","SERVICE WORK","REMARKS","VALUE","WU","WORK PERFORMED",null,null,null,null,null,null,"WORKING TIME",null,{"$f":"SUM(U13:U137)&\"AW\"","v":"11AW"},null,null,null,null,null,null,null,null,"NET","GROSS"]
[null,null,null,null,null,{"$f":"IF(L10=\"X\",MAX($F$9:F9)+1,\"\")","v":""},"A010","Unpacking the bike",null,1,1,null,null,null,null,null,null,null,"NET COST",null,{"$f":"SUM(V13:V135)","v":77},null,null,null,null,null,null,"TOTAL COST",null,{"$f":"SUM(AD13:AD90)","v":0},{"$f":"SUM(AE13:AE121)","v":0}]
[null,null,null,null,null,{"$f":"IF(L11=\"X\",MAX($F$9:F10)+1,\"\")","v":""},"A020","List of supplied accessories",null,1,0.5]
[null,null,null,null,null,{"$f":"IF(L12=\"X\",MAX($F$9:F11)+1,\"\")","v":1},"A030","Inspection and determination of the technical condition of the bicycle",null,1,1,"x",null,null,null,"No.","CODE","SERVICE WORK","REMARKS","VALUE","WU","PRICE",null,null,null,"No.","ARTICLE","STOCK CODE","QTY","NET","GROSS"]
[null,null,null,null,null,{"$f":"IF(L13=\"X\",MAX($F$9:F12)+1,\"\")","v":""},"A040","Photo documentation",null,1,1,null,null,{"$f":"IF(P13=1,\"s\",\"\")","v":"s"},1,{"$f":"_xlfn.IFNA(VLOOKUP($O13,F:F,1,0),\"\")","v":1},{"$f":"_xlfn.IFNA(VLOOKUP($O13,$F:$K,2,0),\"\")","v":"A030"},{"$f":"_xlfn.IFNA(VLOOKUP($O13,F:L,3,0),\"\")","v":"Inspection and determination of the technical condition of the bicycle"},{"$f":"_xlfn.IFNA(IF(ISBLANK(VLOOKUP($O13,$F:$K,4,0)),\"\",VLOOKUP($O13,$F:$K,4,0)),\"\")","v":""},{"$f":"_xlfn.IFNA(IF(ISBLANK(VLOOKUP($O13,$F:$K,5,0)),\"\",VLOOKUP($O13,$F:$K,5,0)),\"\")","v":1},{"$f":"_xlfn.IFNA(IF(P13=\"\",\"\",IF(S13=\"DW\",VLOOKUP(T13,LIST!$A$2:$B$5,2,0)+VLOOKUP($P13,$F:$K,6,0),VLOOKUP($P13,$F:$K,6,0)*T13)),\"\")","v":1},{"$f":"IF(U13=\"\",\"\",U13*$C$9)","v":7},null,null,{"$f":"IF(Z13=1,\"s\",\"\")","v":"s"},{"$f":"IF(ISBLANK(AA13),\"\",1)","v":1},"PLEASE CHOOSE",{"$f":"IF(ISBLANK(AA13),\"\",VLOOKUP($AA13,PARTS!$C:$F,2,0))","v":0},null,{"$f":"IF(ISBLANK(AA13),\"\",IF($AC$7=\"SP\",VLOOKUP($AA13,PARTS!$C:$F,3,0),VLOOKUP($AA13,PARTS!$C:$F,4,0)))","v":0},{"$f":"IF(ISBLANK(AA13),\"\",AC13*AD13*(1+$AC$8))","v":0}]
[null,null,null,null,null,{"$f":"IF(L14=\"X\",MAX($F$9:F13)+1,\"\")","v":2},"A050","Checking system parameters using software",null,1,1,"x",null,{"$f":"IF(P14=\"\",\"\",IF(N13=\"s\",\"z\",\"s\"))","v":"z"},2,2,"A050","Checking system parameters using software",{"$f":"_xlfn.IFNA(IF(ISBLANK(VLOOKUP($O14,$F:$K,4,0)),\"\",VLOOKUP($O14,$F:$K,4,0)),\"\")","v":""},1,{"$f":"_xlfn.IFNA(IF(P14=\"\",\"\",IF(S14=\"DW\",VLOOKUP(T14,LIST!$A$2:$B$5,2,0)+VLOOKUP($P14,$F:$K,6,0),VLOOKUP($P14,$F:$K,6,0)*T14)),\"\")","v":1},7,null,null,{"$f":"IF(Z14=\"\",\"\",IF(Y13=\"s\",\"z\",\"s\"))","v":"z"},{"$f":"IF(ISBLANK(AA14),\"\",MAX($Z13:Z$13)+1)","v":2},"PLEASE CHOOSE",{"$f":"IF(ISBLANK(AA14),\"\",VLOOKUP($AA14,PARTS!$C:$F,2,0))","v":0},null,{"$f":"IF(ISBLANK(AA14),\"\",IF($AC$7=\"SP\",VLOOKUP($AA14,PARTS!$C:$F,3,0),VLOOKUP($AA14,PARTS!$C:$F,4,0)))","v":0},{"$f":"IF(ISBLANK(AA14),\"\",AC14*AD14*(1+$AC$8))","v":0}]
[null,null,null,null,null,{"$f":"IF(L15=\"X\",MAX($F$9:F14)+1,\"\")","v":3},"A060","Test ride","BASIC",{"$f":"IF(I15=\"\",\"\",VLOOKUP(I15,LIST!$N$2:$O$3,2,0)+1)","v":1},1,"x",null,{"$f":"IF(P15=\"\",\"\",IF(N14=\"s\",\"z\",\"s\"))","v":"s"},3,3,"A060","Test ride","BASIC",1,{"$f":"_xlfn.IFNA(IF(P15=\"\",\"\",IF(S15=\"DW\",VLOOKUP(T15,LIST!$A$2:$B$5,2,0)+VLOOKUP($P15,$F:$K,6,0),VLOOKUP($P15,$F:$K,6,0)*T15)),\"\")","v":1},7,null,null,{"$f":"IF(Z15=\"\",\"\",IF(Y14=\"s\",\"z\",\"s\"))","v":"s"},{"$f":"IF(ISBLANK(AA15),\"\",MAX($Z$13:Z14)+1)","v":3},"PLEASE CHOOSE",{"$f":"IF(ISBLANK(AA15),\"\",VLOOKUP($AA15,PARTS!$C:$F,2,0))","v":0},null,{"$f":"IF(ISBLANK(AA15),\"\",IF($AC$7=\"SP\",VLOOKUP($AA15,PARTS!$C:$F,3,0),VLOOKUP($AA15,PARTS!$C:$F,4,0)))","v":0},0]
[null,null,null,null,null,{"$f":"IF(L16=\"X\",MAX($F$9:F15)+1,\"\")","v":""},"A070","Service support",null,1,1,null,null,{"$f":"IF(P16=\"\",\"\",IF(N15=\"s\",\"z\",\"s\"))","v":"z"},4,4,"B010","Test ride after service","BASIC",1,{"$f":"_xlfn.IFNA(IF(P16=\"\",\"\",IF(S16=\"DW\",VLOOKUP(T16,LIST!$A$2:$B$5,2,0)+VLOOKUP($P16,$F:$K,6,0),VLOOKUP($P16,$F:$K,6,0)*T16)),\"\")","v":1},7,null,null,"z",{"$f":"IF(ISBLANK(AA16),\"\",MAX($Z$13:Z15)+1)","v":4},"PLEASE CHOOSE",{"$f":"IF(ISBLANK(AA16),\"\",VLOOKUP($AA16,PARTS!$C:$F,2,0))","v":0},null,{"$f":"IF(ISBLANK(AA16),\"\",IF($AC$7=\"SP\",VLOOKUP($AA16,PARTS!$C:$F,3,0),VLOOKUP($AA16,PARTS!$C:$F,4,0)))","v":0},0]
[null,null,null,null,null,{"$f":"IF(L17=\"X\",MAX($F$9:F16)+1,\"\")","v":""},"B. PREPARING THE BIKE FOR DELIVERY TO THE CUSTOMER",null,null,null,null,null,null,"s",5,5,"J010","Controller replacement","QTY",1,{"$f":"_xlfn.IFNA(IF(P17=\"\",\"\",IF(S17=\"DW\",VLOOKUP(T17,LIST!$A$2:$B$5,2,0)+VLOOKUP($P17,$F:$K,6,0),VLOOKUP($P17,$F:$K,6,0)*T17)),\"\")","v":7},49,null,null,"s",{"$f":"IF(ISBLANK(AA17),\"\",MAX($Z$13:Z16)+1)","v":5},"PLEASE CHOOSE",{"$f":"IF(ISBLANK(AA17),\"\",VLOOKUP($AA17,PARTS!$C:$F,2,0))","v":0},null,{"$f":"IF(ISBLANK(AA17),\"\",IF($AC$7=\"SP\",VLOOKUP($AA17,PARTS!$C:$F,3,0),VLOOKUP($AA17,PARTS!$C:$F,4,0)))","v":0},0]
[null,null,null,null,null,{"$f":"IF(L18=\"X\",MAX($F$9:F17)+1,\"\")","v":""},"CODE","SERVICE WORK","REMARKS","VALUE","WU","WORK PERFORMED",null,"",6,"","","","","",{"$f":"_xlfn.IFNA(IF(P18=\"\",\"\",IF(S18=\"DW\",VLOOKUP(T18,LIST!$A$2:$B$5,2,0)+VLOOKUP($P18,$F:$K,6,0),VLOOKUP($P18,$F:$K,6,0)*T18)),\"\")","v":""},"",null,null,"z",{"$f":"IF(ISBLANK(AA18),\"\",MAX($Z$13:Z17)+1)","v":6},"PLEASE CHOOSE",{"$f":"IF(ISBLANK(AA18),\"\",VLOOKUP($AA18,PARTS!$C:$F,2,0))","v":0},null,{"$f":"IF(ISBLANK(AA18),\"\",IF($AC$7=\"SP\",VLOOKUP($AA18,PARTS!$C:$F,3,0),VLOOKUP($AA18,PARTS!$C:$F,4,0)))","v":0},0]
[null,null,null,null,null,{"$f":"IF(L19=\"X\",MAX($F$9:F18)+1,\"\")","v":4},"B010","Test ride after service","BASIC",{"$f":"IF(I19=\"\",\"\",VLOOKUP(I19,LIST!$N$2:$O$3,2,0)+1)","v":1},1,"x",null,"",7,"","","","","",{"$f":"_xlfn.IFNA(IF(P19=\"\",\"\",IF(S19=\"DW\",VLOOKUP(T19,LIST!$A$2:$B$5,2,0)+VLOOKUP($P19,$F:$K,6,0),VLOOKUP($P19,$F:$K,6,0)*T19)),\"\")","v":""},"",null,null,"s",{"$f":"IF(ISBLANK(AA19),\"\",MAX($Z$13:Z18)+1)","v":7},"PLEASE CHOOSE",{"$f":"IF(ISBLANK(AA19),\"\",VLOOKUP($AA19,PARTS!$C:$F,2,0))","v":0},null,{"$f":"IF(ISBLANK(AA19),\"\",IF($AC$7=\"SP\",VLOOKUP($AA19,PARTS!$C:$F,3,0),VLOOKUP($AA19,PARTS!$C:$F,4,0)))","v":0},0]
[null,null,null,null,null,{"$f":"IF(L20=\"X\",MAX($F$9:F19)+1,\"\")","v":""},"B020","Cleaning","BASIC",{"$f":"IF(I20=\"\",\"\",VLOOKUP(I20,LIST!$K$2:$L$4,2,0)+1)","v":1},1,null,null,{"$f":"IF(P20=\"\",\"\",IF(N19=\"s\",\"z\",\"s\"))","v":""},8,"","","","","",{"$f":"_xlfn.IFNA(IF(P20=\"\",\"\",IF(S20=\"DW\",VLOOKUP(T20,LIST!$A$2:$B$5,2,0)+VLOOKUP($P20,$F:$K,6,0),VLOOKUP($P20,$F:$K,6,0)*T20)),\"\")","v":""},"",null,null,"z",{"$f":"IF(ISBLANK(AA20),\"\",MAX($Z$13:Z19)+1)","v":8},"PLEASE CHOOSE",{"$f":"IF(ISBLANK(AA20),\"\",VLOOKUP($AA20,PARTS!$C:$F,2,0))","v":0},null,{"$f":"IF(ISBLANK(AA20),\"\",IF($AC$7=\"SP\",VLOOKUP($AA20,PARTS!$C:$F,3,0),VLOOKUP($AA20,PARTS!$C:$F,4,0)))","v":0},0]
[null,null,null,null,null,{"$f":"IF(L21=\"X\",MAX($F$9:F20)+1,\"\")","v":""},"B030","Packing the bike",null,1,2,null,null,{"$f":"IF(P21=\"\",\"\",IF(N20=\"s\",\"z\",\"s\"))","v":""},9,"","","","","",{"$f":"_xlfn.IFNA(IF(P21=\"\",\"\",IF(S21=\"DW\",VLOOKUP(T21,LIST!$A$2:$B$5,2,0)+VLOOKUP($P21,$F:$K,6,0),VLOOKUP($P21,$F:$K,6,0)*T21)),\"\")","v":""},"",null,null,"s",{"$f":"IF(ISBLANK(AA21),\"\",MAX($Z$13:Z20)+1)","v":9},"PLEASE CHOOSE",{"$f":"IF(ISBLANK(AA21),\"\",VLOOKUP($AA21,PARTS!$C:$F,2,0))","v":0},null,{"$f":"IF(ISBLANK(AA21),\"\",IF($AC$7=\"SP\",VLOOKUP($AA21,PARTS!$C:$F,3,0),VLOOKUP($AA21,PARTS!$C:$F,4,0)))","v":0},0]
[null,null,null,null,null,{"$f":"IF(L22=\"X\",MAX($F$9:F21)+1,\"\")","v":""},"C. BIKE EQUIPMENT",null,null,null,null,null,null,"",10,"","","","","",{"$f":"_xlfn.IFNA(IF(P22=\"\",\"\",IF(S22=\"DW\",VLOOKUP(T22,LIST!$A$2:$B$5,2,0)+VLOOKUP($P22,$F:$K,6,0),VLOOKUP($P22,$F:$K,6,0)*T22)),\"\")","v":""},"",null,null,"z",{"$f":"IF(ISBLANK(AA22),\"\",MAX($Z$13:Z21)+1)","v":10},"PLEASE CHOOSE",{"$f":"IF(ISBLANK(AA22),\"\",VLOOKUP($AA22,PARTS!$C:$F,2,0))","v":0},null,{"$f":"IF(ISBLANK(AA22),\"\",IF($AC$7=\"SP\",VLOOKUP($AA22,PARTS!$C:$F,3,0),VLOOKUP($AA22,PARTS!$C:$F,4,0)))","v":0},0]
[null,null,null,null,null,{"$f":"IF(L23=\"X\",MAX($F$9:F22)+1,\"\")","v":""},"CODE","SERVICE WORK","REMARKS","VALUE","WU","WORK PERFORMED",null,{"$f":"IF(P23=\"\",\"\",IF(N22=\"s\",\"z\",\"s\"))","v":""},11,"","","","","",{"$f":"_xlfn.IFNA(IF(P23=\"\",\"\",IF(S23=\"DW\",VLOOKUP(T23,LIST!$A$2:$B$5,2,0)+VLOOKUP($P23,$F:$K,6,0),VLOOKUP($P23,$F:$K,6,0)*T23)),\"\")","v":""},"",null,null,"s",{"$f":"IF(ISBLANK(AA23),\"\",MAX($Z$13:Z22)+1)","v":11},"PLEASE CHOOSE",{"$f":"IF(ISBLANK(AA23),\"\",VLOOKUP($AA23,PARTS!$C:$F,2,0))","v":0},null,{"$f":"IF(ISBLANK(AA23),\"\",IF($AC$7=\"SP\",VLOOKUP($AA23,PARTS!$C:$F,3,0),VLOOKUP($AA23,PARTS!$C:$F,4,0)))","v":0},0]
[null,null,null,null,null,{"$f":"IF(L24=\"X\",MAX($F$9:F23)+1,\"\")","v":""},"C010","Rear carrier replacement",null,1,4,null,null,{"$f":"IF(P24=\"\",\"\",IF(N23=\"s\",\"z\",\"s\"))","v":""},12,"","","","","",{"$f":"_xlfn.IFNA(IF(P24=\"\",\"\",IF(S24=\"DW\",VLOOKUP(T24,LIST!$A$2:$B$5,2,0)+VLOOKUP($P24,$F:$K,6,0),VLOOKUP($P24,$F:$K,6,0)*T24)),\"\")","v":""},"",null,null,"z",{"$f":"IF(ISBLANK(AA24),\"\",MAX($Z$13:Z23)+1)","v":12},"PLEASE CHOOSE",{"$f":"IF(ISBLANK(AA24),\"\",VLOOKUP($AA24,PARTS!$C:$F,2,0))","v":0},null,{"$f":"IF(ISBLANK(AA24),\"\",IF($AC$7=\"SP\",VLOOKUP($AA24,PARTS!$C:$F,3,0),VLOOKUP($AA24,PARTS!$C:$F,4,0)))","v":0},0]
[null,null,null,null,null,{"$f":"IF(L25=\"X\",MAX($F$9:F24)+1,\"\")","v":""},"C020","Kickstand replacement",null,1,1,null,null,"",13,"","","","","",{"$f":"_xlfn.IFNA(IF(P25=\"\",\"\",IF(S25=\"DW\",VLOOKUP(T25,LIST!$A$2:$B$5,2,0)+VLOOKUP($P25,$F:$K,6,0),VLOOKUP($P25,$F:$K,6,0)*T25)),\"\")","v":""},"",null,null,"s",{"$f":"IF(ISBLANK(AA25),\"\",MAX($Z$13:Z24)+1)","v":13},"PLEASE CHOOSE",{"$f":"IF(ISBLANK(AA25),\"\",VLOOKUP($AA25,PARTS!$C:$F,2,0))","v":0},null,{"$f":"IF(ISBLANK(AA25),\"\",IF($AC$7=\"SP\",VLOOKUP($AA25,PARTS!$C:$F,3,0),VLOOKUP($AA25,PARTS!$C:$F,4,0)))","v":0},0]
[null,null,null,null,null,{"$f":"IF(L26=\"X\",MAX($F$9:F25)+1,\"\")","v":""},"C030","Front fender replacement",null,1,2,null,null,"",14,"","","","","",{"$f":"_xlfn.IFNA(IF(P26=\"\",\"\",IF(S26=\"DW\",VLOOKUP(T26,LIST!$A$2:$B$5,2,0)+VLOOKUP($P26,$F:$K,6,0),VLOOKUP($P26,$F:$K,6,0)*T26)),\"\")","v":""},"",null,null,"z",{"$f":"IF(ISBLANK(AA26),\"\",MAX($Z$13:Z25)+1)","v":14},"PLEASE CHOOSE",{"$f":"IF(ISBLANK(AA26),\"\",VLOOKUP($AA26,PARTS!$C:$F,2,0))","v":0},null,{"$f":"IF(ISBLANK(AA26),\"\",IF($AC$7=\"SP\",VLOOKUP($AA26,PARTS!$C:$F,3,0),VLOOKUP($AA26,PARTS!$C:$F,4,0)))","v":0},0]
[null,null,null,null,null,{"$f":"IF(L27=\"X\",MAX($F$9:F26)+1,\"\")","v":""},"C040","Rear fender replacement",null,1,6,null,null,"",15,"","","","","",{"$f":"_xlfn.IFNA(IF(P27=\"\",\"\",IF(S27=\"DW\",VLOOKUP(T27,LIST!$A$2:$B$5,2,0)+VLOOKUP($P27,$F:$K,6,0),VLOOKUP($P27,$F:$K,6,0)*T27)),\"\")","v":""},"",null,null,"s",{"$f":"IF(ISBLANK(AA27),\"\",MAX($Z$13:Z26)+1)","v":15},"PLEASE CHOOSE",{"$f":"IF(ISBLANK(AA27),\"\",VLOOKUP($AA27,PARTS!$C:$F,2,0))","v":0},null,{"$f":"IF(ISBLANK(AA27),\"\",IF($AC$7=\"SP\",VLOOKUP($AA27,PARTS!$C:$F,3,0),VLOOKUP($AA27,PARTS!$C:$F,4,0)))","v":0},0]
[null,null,null,null,null,{"$f":"IF(L28=\"X\",MAX($F$9:F27)+1,\"\")","v":""},"C050","Front light replacement","DW",1,2,null,null,"",16,"","","","","",{"$f":"_xlfn.IFNA(IF(P28=\"\",\"\",IF(S28=\"DW\",VLOOKUP(T28,LIST!$A$2:$B$5,2,0)+VLOOKUP($P28,$F:$K,6,0),VLOOKUP($P28,$F:$K,6,0)*T28)),\"\")","v":""},"",null,null,"z",{"$f":"IF(ISBLANK(AA28),\"\",MAX($Z$13:Z27)+1)","v":16},"PLEASE CHOOSE",{"$f":"IF(ISBLANK(AA28),\"\",VLOOKUP($AA28,PARTS!$C:$F,2,0))","v":0},null,{"$f":"IF(ISBLANK(AA28),\"\",IF($AC$7=\"SP\",VLOOKUP($AA28,PARTS!$C:$F,3,0),VLOOKUP($AA28,PARTS!$C:$F,4,0)))","v":0},0]
[null,null,null,null,null,{"$f":"IF(L29=\"X\",MAX($F$9:F28)+1,\"\")","v":""},"C060","Rear light replacement",null,1,2.5,null,null,"",17,"","","","","",{"$f":"_xlfn.IFNA(IF(P29=\"\",\"\",IF(S29=\"DW\",VLOOKUP(T29,LIST!$A$2:$B$5,2,0)+VLOOKUP($P29,$F:$K,6,0),VLOOKUP($P29,$F:$K,6,0)*T29)),\"\")","v":""},"",null,null,"s",{"$f":"IF(ISBLANK(AA29),\"\",MAX($Z$13:Z28)+1)","v":17},"PLEASE CHOOSE",{"$f":"IF(ISBLANK(AA29),\"\",VLOOKUP($AA29,PARTS!$C:$F,2,0))","v":0},null,{"$f":"IF(ISBLANK(AA29),\"\",IF($AC$7=\"SP\",VLOOKUP($AA29,PARTS!$C:$F,3,0),VLOOKUP($AA29,PARTS!$C:$F,4,0)))","v":0},0]
[null,null,null,null,null,{"$f":"IF(L30=\"X\",MAX($F$9:F29)+1,\"\")","v":""},"C070","Pedal replacement",null,1,1,null,null,"",18,"","","","","",{"$f":"_xlfn.IFNA(IF(P30=\"\",\"\",IF(S30=\"DW\",VLOOKUP(T30,LIST!$A$2:$B$5,2,0)+VLOOKUP($P30,$F:$K,6,0),VLOOKUP($P30,$F:$K,6,0)*T30)),\"\")","v":""},"",{"$f":"IF(Y30=\"\",\"\",IF(Y29=\"s\",\"z\",\"s\"))","v":""},null,{"$f":"IF(ISBLANK(Z30),\"\",MAX($Z$13:Z29)+1)","v":""},null,null,{"$f":"IF(ISBLANK(AA30),\"\",VLOOKUP($AA30,PARTS!$C:$F,2,0))","v":""},null,{"$f":"IF(ISBLANK(AA30),\"\",IF($AC$7=\"SP\",VLOOKUP($AA30,PARTS!$C:$F,3,0),VLOOKUP($AA30,PARTS!$C:$F,4,0)))","v":""}]
[null,null,null,null,null,{"$f":"IF(L31=\"X\",MAX($F$9:F30)+1,\"\")","v":""},"D. WHEELS",null,null,null,null,null,null,"",19,"","","","","",{"$f":"_xlfn.IFNA(IF(P31=\"\",\"\",IF(S31=\"DW\",VLOOKUP(T31,LIST!$A$2:$B$5,2,0)+VLOOKUP($P31,$F:$K,6,0),VLOOKUP($P31,$F:$K,6,0)*T31)),\"\")","v":""},"",{"$f":"IF(Y31=\"\",\"\",IF(W30=\"s\",\"z\",\"s\"))","v":""},null,{"$f":"IF(ISBLANK(Z31),\"\",MAX($Y$13:Y30)+1)","v":""},null,null,{"$f":"IF(ISBLANK(AA31),\"\",VLOOKUP($AA31,PARTS!$C:$F,2,0))","v":""},null,{"$f":"IF(ISBLANK(AA31),\"\",IF($AC$7=\"SP\",VLOOKUP($AA31,PARTS!$C:$F,3,0),VLOOKUP($AA31,PARTS!$C:$F,4,0)))","v":""}]
[null,null,null,null,null,{"$f":"IF(L32=\"X\",MAX($F$9:F31)+1,\"\")","v":""},"CODE","SERVICE WORK","REMARKS","VALUE","WU","WORK PERFORMED",null,"",20,"","","","","",{"$f":"_xlfn.IFNA(IF(P32=\"\",\"\",IF(S32=\"DW\",VLOOKUP(T32,LIST!$A$2:$B$5,2,0)+VLOOKUP($P32,$F:$K,6,0),VLOOKUP($P32,$F:$K,6,0)*T32)),\"\")","v":""},"","",null,{"$f":"IF(ISBLANK(Z32),\"\",MAX($Y$13:Y31)+1)","v":""},null,null,{"$f":"IF(ISBLANK(AA32),\"\",VLOOKUP($AA32,PARTS!$C:$F,2,0))","v":""},null,{"$f":"IF(ISBLANK(AA32),\"\",IF($AC$7=\"SP\",VLOOKUP($AA32,PARTS!$C:$F,3,0),VLOOKUP($AA32,PARTS!$C:$F,4,0)))","v":""}]
[null,null,null,null,null,{"$f":"IF(L33=\"X\",MAX($F$9:F32)+1,\"\")","v":""},"D010","Checking the pressure and pumping",null,1,0.5,null,null,"",21,"","","","","",{"$f":"_xlfn.IFNA(IF(P33=\"\",\"\",IF(S33=\"DW\",VLOOKUP(T33,LIST!$A$2:$B$5,2,0)+VLOOKUP($P33,$F:$K,6,0),VLOOKUP($P33,$F:$K,6,0)*T33)),\"\")","v":""},"","",null,{"$f":"IF(ISBLANK(Z33),\"\",MAX($Y$13:Y32)+1)","v":""},null,null,{"$f":"IF(ISBLANK(AA33),\"\",VLOOKUP($AA33,PARTS!$C:$F,2,0))","v":""},null,{"$f":"IF(ISBLANK(AA33),\"\",IF($AC$7=\"SP\",VLOOKUP($AA33,PARTS!$C:$F,3,0),VLOOKUP($AA33,PARTS!$C:$F,4,0)))","v":""}]
[null,null,null,null,null,{"$f":"IF(L34=\"X\",MAX($F$9:F33)+1,\"\")","v":""},"D020","Checking the condition of tires",null,1,0.25,null,null,"",22,"","","","","",{"$f":"_xlfn.IFNA(IF(P34=\"\",\"\",IF(S34=\"DW\",VLOOKUP(T34,LIST!$A$2:$B$5,2,0)+VLOOKUP($P34,$F:$K,6,0),VLOOKUP($P34,$F:$K,6,0)*T34)),\"\")","v":""},"","",null,{"$f":"IF(ISBLANK(Z34),\"\",MAX($Y$13:Y33)+1)","v":""},null,null,{"$f":"IF(ISBLANK(AA34),\"\",VLOOKUP($AA34,PARTS!$C:$F,2,0))","v":""},null,{"$f":"IF(ISBLANK(AA34),\"\",IF($AC$7=\"SP\",VLOOKUP($AA34,PARTS!$C:$F,3,0),VLOOKUP($AA34,PARTS!$C:$F,4,0)))","v":""}]
[null,null,null,null,null,{"$f":"IF(L35=\"X\",MAX($F$9:F34)+1,\"\")","v":""},"D030","Installing the QR front wheel","QTY",1,0.25,null,null,"",23,"","","","","",{"$f":"_xlfn.IFNA(IF(P35=\"\",\"\",IF(S35=\"DW\",VLOOKUP(T35,LIST!$A$2:$B$5,2,0)+VLOOKUP($P35,$F:$K,6,0),VLOOKUP($P35,$F:$K,6,0)*T35)),\"\")","v":""},"","",null,{"$f":"IF(ISBLANK(Z35),\"\",MAX($Y$13:Y34)+1)","v":""},null,null,{"$f":"IF(ISBLANK(AA35),\"\",VLOOKUP($AA35,PARTS!$C:$F,2,0))","v":""},null,{"$f":"IF(ISBLANK(AA35),\"\",IF($AC$7=\"SP\",VLOOKUP($AA35,PARTS!$C:$F,3,0),VLOOKUP($AA35,PARTS!$C:$F,4,0)))","v":""}]
[null,null,null,null,null,{"$f":"IF(L36=\"X\",MAX($F$9:F35)+1,\"\")","v":""},"D040","Removing the front QR wheel","QTY",1,0.25,null,null,"",24,"","","","","",{"$f":"_xlfn.IFNA(IF(P36=\"\",\"\",IF(S36=\"DW\",VLOOKUP(T36,LIST!$A$2:$B$5,2,0)+VLOOKUP($P36,$F:$K,6,0),VLOOKUP($P36,$F:$K,6,0)*T36)),\"\")","v":""},"","",null,{"$f":"IF(ISBLANK(Z36),\"\",MAX($Y$13:Y35)+1)","v":""},null,null,{"$f":"IF(ISBLANK(AA36),\"\",VLOOKUP($AA36,PARTS!$C:$F,2,0))","v":""},null,{"$f":"IF(ISBLANK(AA36),\"\",IF($AC$7=\"SP\",VLOOKUP($AA36,PARTS!$C:$F,3,0),VLOOKUP($AA36,PARTS!$C:$F,4,0)))","v":""}]
[null,null,null,null,null,{"$f":"IF(L37=\"X\",MAX($F$9:F36)+1,\"\")","v":""},"D050","Installing the TA front wheel","QTY",1,0.25,null,null,"",25,"","","","","",{"$f":"_xlfn.IFNA(IF(P37=\"\",\"\",IF(S37=\"DW\",VLOOKUP(T37,LIST!$A$2:$B$5,2,0)+VLOOKUP($P37,$F:$K,6,0),VLOOKUP($P37,$F:$K,6,0)*T37)),\"\")","v":""},"","",null,{"$f":"IF(ISBLANK(Z37),\"\",MAX($Y$13:Y36)+1)","v":""},null,null,{"$f":"IF(ISBLANK(AA37),\"\",VLOOKUP($AA37,PARTS!$C:$F,2,0))","v":""},null,{"$f":"IF(ISBLANK(AA37),\"\",IF($AC$7=\"SP\",VLOOKUP($AA37,PARTS!$C:$F,3,0),VLOOKUP($AA37,PARTS!$C:$F,4,0)))","v":""}]
[null,null,null,null,null,{"$f":"IF(L38=\"X\",MAX($F$9:F37)+1,\"\")","v":""},"D060","Removing the front wheel TA","QTY",1,0.25,null,null,"",26,"","","","","",{"$f":"_xlfn.IFNA(IF(P38=\"\",\"\",IF(S38=\"DW\",VLOOKUP(T38,LIST!$A$2:$B$5,2,0)+VLOOKUP($P38,$F:$K,6,0),VLOOKUP($P38,$F:$K,6,0)*T38)),\"\")","v":""},"","",null,{"$f":"IF(ISBLANK(Z38),\"\",MAX($Y$13:Y37)+1)","v":""},null,null,{"$f":"IF(ISBLANK(AA38),\"\",VLOOKUP($AA38,PARTS!$C:$F,2,0))","v":""},null,{"$f":"IF(ISBLANK(AA38),\"\",IF($AC$7=\"SP\",VLOOKUP($AA38,PARTS!$C:$F,3,0),VLOOKUP($AA38,PARTS!$C:$F,4,0)))","v":""}]
[null,null,null,null,null,{"$f":"IF(L39=\"X\",MAX($F$9:F38)+1,\"\")","v":""},"D070","Instaling the rear wheel","QTY",1,1,null,null,"",27,"","","","","",{"$f":"_xlfn.IFNA(IF(P39=\"\",\"\",IF(S39=\"DW\",VLOOKUP(T39,LIST!$A$2:$B$5,2,0)+VLOOKUP($P39,$F:$K,6,0),VLOOKUP($P39,$F:$K,6,0)*T39)),\"\")","v":""},"","",null,{"$f":"IF(ISBLANK(Z39),\"\",MAX($Y$13:Y38)+1)","v":""},null,null,{"$f":"IF(ISBLANK(AA39),\"\",VLOOKUP($AA39,PARTS!$C:$F,2,0))","v":""},null,{"$f":"IF(ISBLANK(AA39),\"\",IF($AC$7=\"SP\",VLOOKUP($AA39,PARTS!$C:$F,3,0),VLOOKUP($AA39,PARTS!$C:$F,4,0)))","v":""}]
[null,null,null,null,null,{"$f":"IF(L40=\"X\",MAX($F$9:F39)+1,\"\")","v":""},"D080","Removing the rear wheel","QTY",1,0.75,null,null,"",28,"","","","","",{"$f":"_xlfn.IFNA(IF(P40=\"\",\"\",IF(S40=\"DW\",VLOOKUP(T40,LIST!$A$2:$B$5,2,0)+VLOOKUP($P40,$F:$K,6,0),VLOOKUP($P40,$F:$K,6,0)*T40)),\"\")","v":""},"","",null,{"$f":"IF(ISBLANK(Z40),\"\",MAX($Y$13:Y39)+1)","v":""},null,null,{"$f":"IF(ISBLANK(AA40),\"\",VLOOKUP($AA40,PARTS!$C:$F,2,0))","v":""},null,{"$f":"IF(ISBLANK(AA40),\"\",IF($AC$7=\"SP\",VLOOKUP($AA40,PARTS!$C:$F,3,0),VLOOKUP($AA40,PARTS!$C:$F,4,0)))","v":""}]
[null,null,null,null,null,{"$f":"IF(L41=\"X\",MAX($F$9:F40)+1,\"\")","v":""},"D090","Tire replacement","QTY",1,1.5,null,null,"",29,"","","","","",{"$f":"_xlfn.IFNA(IF(P41=\"\",\"\",IF(S41=\"DW\",VLOOKUP(T41,LIST!$A$2:$B$5,2,0)+VLOOKUP($P41,$F:$K,6,0),VLOOKUP($P41,$F:$K,6,0)*T41)),\"\")","v":""},"","",null,{"$f":"IF(ISBLANK(Z41),\"\",MAX($Y$13:Y40)+1)","v":""},null,null,{"$f":"IF(ISBLANK(AA41),\"\",VLOOKUP($AA41,PARTS!$C:$F,2,0))","v":""},null,{"$f":"IF(ISBLANK(AA41),\"\",IF($AC$7=\"SP\",VLOOKUP($AA41,PARTS!$C:$F,3,0),VLOOKUP($AA41,PARTS!$C:$F,4,0)))","v":""}]
[null,null,null,null,null,{"$f":"IF(L42=\"X\",MAX($F$9:F41)+1,\"\")","v":""},"D100","Inner tube replacement","QTY",1,1.5,null,null,"",30,"","","","","",{"$f":"_xlfn.IFNA(IF(P42=\"\",\"\",IF(S42=\"DW\",VLOOKUP(T42,LIST!$A$2:$B$5,2,0)+VLOOKUP($P42,$F:$K,6,0),VLOOKUP($P42,$F:$K,6,0)*T42)),\"\")","v":""},"","",null,{"$f":"IF(ISBLANK(Z42),\"\",MAX($Y$13:Y41)+1)","v":""},null,null,{"$f":"IF(ISBLANK(AA42),\"\",VLOOKUP($AA42,PARTS!$C:$F,2,0))","v":""},null,{"$f":"IF(ISBLANK(AA42),\"\",IF($AC$7=\"SP\",VLOOKUP($AA42,PARTS!$C:$F,3,0),VLOOKUP($AA42,PARTS!$C:$F,4,0)))","v":""}]
[null,null,null,null,null,{"$f":"IF(L43=\"X\",MAX($F$9:F42)+1,\"\")","v":""},"D110","Rim tape replacement","QTY",1,1.5,null,null,"",31,"","","","","",{"$f":"_xlfn.IFNA(IF(P43=\"\",\"\",IF(S43=\"DW\",VLOOKUP(T43,LIST!$A$2:$B$5,2,0)+VLOOKUP($P43,$F:$K,6,0),VLOOKUP($P43,$F:$K,6,0)*T43)),\"\")","v":""},"","",null,{"$f":"IF(ISBLANK(Z43),\"\",MAX($Y$13:Y42)+1)","v":""},null,null,{"$f":"IF(ISBLANK(AA43),\"\",VLOOKUP($AA43,PARTS!$C:$F,2,0))","v":""},null,{"$f":"IF(ISBLANK(AA43),\"\",IF($AC$7=\"SP\",VLOOKUP($AA43,PARTS!$C:$F,3,0),VLOOKUP($AA43,PARTS!$C:$F,4,0)))","v":""}]
[null,null,null,null,null,{"$f":"IF(L44=\"X\",MAX($F$9:F43)+1,\"\")","v":""},"D120","Sprocket cassette replacement (chain drive)",null,1,1,null,null,"",32,"","","","","",{"$f":"_xlfn.IFNA(IF(P44=\"\",\"\",IF(S44=\"DW\",VLOOKUP(T44,LIST!$A$2:$B$5,2,0)+VLOOKUP($P44,$F:$K,6,0),VLOOKUP($P44,$F:$K,6,0)*T44)),\"\")","v":""},"","",null,{"$f":"IF(ISBLANK(Z44),\"\",MAX($Y$13:Y43)+1)","v":""},null,null,{"$f":"IF(ISBLANK(AA44),\"\",VLOOKUP($AA44,PARTS!$C:$F,2,0))","v":""},null,{"$f":"IF(ISBLANK(AA44),\"\",IF($AC$7=\"SP\",VLOOKUP($AA44,PARTS!$C:$F,3,0),VLOOKUP($AA44,PARTS!$C:$F,4,0)))","v":""}]
[null,null,null,null,null,{"$f":"IF(L45=\"X\",MAX($F$9:F44)+1,\"\")","v":""},"D130","Sprocket replacement (belt drive)",null,1,1,null,null,"",33,{"$f":"_xlfn.IFNA(VLOOKUP($O45,F:F,1,0),\"\")","v":""},{"$f":"_xlfn.IFNA(VLOOKUP($O45,$F:$K,2,0),\"\")","v":""},{"$f":"_xlfn.IFNA(VLOOKUP($O45,F:L,3,0),\"\")","v":""},{"$f":"_xlfn.IFNA(IF(ISBLANK(VLOOKUP($O45,$F:$K,4,0)),\"\",VLOOKUP($O45,$F:$K,4,0)),\"\")","v":""},{"$f":"_xlfn.IFNA(IF(ISBLANK(VLOOKUP($O45,$F:$K,5,0)),\"\",VLOOKUP($O45,$F:$K,5,0)),\"\")","v":""},{"$f":"_xlfn.IFNA(IF(P45=\"\",\"\",IF(S45=\"DW\",VLOOKUP(T45,LIST!$A$2:$B$5,2,0)+VLOOKUP($P45,$F:$K,6,0),VLOOKUP($P45,$F:$K,6,0)*T45)),\"\")","v":""},"","",null,{"$f":"IF(ISBLANK(Z45),\"\",MAX($Y$13:Y44)+1)","v":""},null,null,{"$f":"IF(ISBLANK(AA45),\"\",VLOOKUP($AA45,PARTS!$C:$F,2,0))","v":""},null,{"$f":"IF(ISBLANK(AA45),\"\",IF($AC$7=\"SP\",VLOOKUP($AA45,PARTS!$C:$F,3,0),VLOOKUP($AA45,PARTS!$C:$F,4,0)))","v":""}]
[null,null,null,null,null,{"$f":"IF(L46=\"X\",MAX($F$9:F45)+1,\"\")","v":""},"D140","Disc rotor replacement","QTY",1,1,null,null,"",34,"","","","","",{"$f":"_xlfn.IFNA(IF(P46=\"\",\"\",IF(S46=\"DW\",VLOOKUP(T46,LIST!$A$2:$B$5,2,0)+VLOOKUP($P46,$F:$K,6,0),VLOOKUP($P46,$F:$K,6,0)*T46)),\"\")","v":""},"","",null,{"$f":"IF(ISBLANK(Z46),\"\",MAX($Y$13:Y45)+1)","v":""},null,null,{"$f":"IF(ISBLANK(AA46),\"\",VLOOKUP($AA46,PARTS!$C:$F,2,0))","v":""},null,{"$f":"IF(ISBLANK(AA46),\"\",IF($AC$7=\"SP\",VLOOKUP($AA46,PARTS!$C:$F,3,0),VLOOKUP($AA46,PARTS!$C:$F,4,0)))","v":""}]
[null,null,null,null,null,{"$f":"IF(L47=\"X\",MAX($F$9:F46)+1,\"\")","v":""},"D150","Freehub body replacement",null,1,3,null,null,"",35,"","","","","",{"$f":"_xlfn.IFNA(IF(P47=\"\",\"\",IF(S47=\"DW\",VLOOKUP(T47,LIST!$A$2:$B$5,2,0)+VLOOKUP($P47,$F:$K,6,0),VLOOKUP($P47,$F:$K,6,0)*T47)),\"\")","v":""},"","",null,{"$f":"IF(ISBLANK(Z47),\"\",MAX($Y$13:Y46)+1)","v":""},null,null,{"$f":"IF(ISBLANK(AA47),\"\",VLOOKUP($AA47,PARTS!$C:$F,2,0))","v":""},null,{"$f":"IF(ISBLANK(AA47),\"\",IF($AC$7=\"SP\",VLOOKUP($AA47,PARTS!$C:$F,3,0),VLOOKUP($AA47,PARTS!$C:$F,4,0)))","v":""}]
[null,null,null,null,null,{"$f":"IF(L48=\"X\",MAX($F$9:F47)+1,\"\")","v":""},"D160","Bearings in the engine replacement",null,1,3,null,null,{"$f":"IF(P48=\"\",\"\",IF(N47=\"s\",\"z\",\"s\"))","v":""},36,"","","","","",{"$f":"_xlfn.IFNA(IF(P48=\"\",\"\",IF(S48=\"DW\",VLOOKUP(T48,LIST!$A$2:$B$5,2,0)+VLOOKUP($P48,$F:$K,6,0),VLOOKUP($P48,$F:$K,6,0)*T48)),\"\")","v":""},"","",null,{"$f":"IF(ISBLANK(Z48),\"\",MAX($Y$13:Y47)+1)","v":""},null,null,{"$f":"IF(ISBLANK(AA48),\"\",VLOOKUP($AA48,PARTS!$C:$F,2,0))","v":""},null,{"$f":"IF(ISBLANK(AA48),\"\",IF($AC$7=\"SP\",VLOOKUP($AA48,PARTS!$C:$F,3,0),VLOOKUP($AA48,PARTS!$C:$F,4,0)))","v":""}]
[null,null,null,null,null,{"$f":"IF(L49=\"X\",MAX($F$9:F48)+1,\"\")","v":""},"D170","Play of the hub bearings adjustment",null,1,1,null,null,"",37,"","","","","",{"$f":"_xlfn.IFNA(IF(P49=\"\",\"\",IF(S49=\"DW\",VLOOKUP(T49,LIST!$A$2:$B$5,2,0)+VLOOKUP($P49,$F:$K,6,0),VLOOKUP($P49,$F:$K,6,0)*T49)),\"\")","v":""},"","",null,{"$f":"IF(ISBLANK(Z49),\"\",MAX($Y$13:Y48)+1)","v":""},null,null,{"$f":"IF(ISBLANK(AA49),\"\",VLOOKUP($AA49,PARTS!$C:$F,2,0))","v":""},null,{"$f":"IF(ISBLANK(AA49),\"\",IF($AC$7=\"SP\",VLOOKUP($AA49,PARTS!$C:$F,3,0),VLOOKUP($AA49,PARTS!$C:$F,4,0)))","v":""}]
[null,null,null,null,null,{"$f":"IF(L50=\"X\",MAX($F$9:F49)+1,\"\")","v":""},"D180","Checking the centricity of the wheel","QTY",1,1,null,null,"",38,"","","","","",{"$f":"_xlfn.IFNA(IF(P50=\"\",\"\",IF(S50=\"DW\",VLOOKUP(T50,LIST!$A$2:$B$5,2,0)+VLOOKUP($P50,$F:$K,6,0),VLOOKUP($P50,$F:$K,6,0)*T50)),\"\")","v":""},"","",null,{"$f":"IF(ISBLANK(Z50),\"\",MAX($Y$13:Y49)+1)","v":""},null,null,{"$f":"IF(ISBLANK(AA50),\"\",VLOOKUP($AA50,PARTS!$C:$F,2,0))","v":""},null,{"$f":"IF(ISBLANK(AA50),\"\",IF($AC$7=\"SP\",VLOOKUP($AA50,PARTS!$C:$F,3,0),VLOOKUP($AA50,PARTS!$C:$F,4,0)))","v":""}]
[null,null,null,null,null,{"$f":"IF(L51=\"X\",MAX($F$9:F50)+1,\"\")","v":""},"D190","Checking the spoke tension","QTY",1,1,null,null,"",39,"","","","","",{"$f":"_xlfn.IFNA(IF(P51=\"\",\"\",IF(S51=\"DW\",VLOOKUP(T51,LIST!$A$2:$B$5,2,0)+VLOOKUP($P51,$F:$K,6,0),VLOOKUP($P51,$F:$K,6,0)*T51)),\"\")","v":""},"","",null,{"$f":"IF(ISBLANK(Z51),\"\",MAX($Y$13:Y50)+1)","v":""},null,null,{"$f":"IF(ISBLANK(AA51),\"\",VLOOKUP($AA51,PARTS!$C:$F,2,0))","v":""},null,{"$f":"IF(ISBLANK(AA51),\"\",IF($AC$7=\"SP\",VLOOKUP($AA51,PARTS!$C:$F,3,0),VLOOKUP($AA51,PARTS!$C:$F,4,0)))","v":""}]
[null,null,null,null,null,{"$f":"IF(L52=\"X\",MAX($F$9:F51)+1,\"\")","v":""},"D200","Centering","DW",1,4,null,null,"",40,"","","","","",{"$f":"_xlfn.IFNA(IF(P52=\"\",\"\",IF(S52=\"DW\",VLOOKUP(T52,LIST!$A$2:$B$5,2,0)+VLOOKUP($P52,$F:$K,6,0),VLOOKUP($P52,$F:$K,6,0)*T52)),\"\")","v":""},"","",null,{"$f":"IF(ISBLANK(Z52),\"\",MAX($Y$13:Y51)+1)","v":""},null,null,{"$f":"IF(ISBLANK(AA52),\"\",VLOOKUP($AA52,PARTS!$C:$F,2,0))","v":""},null,{"$f":"IF(ISBLANK(AA52),\"\",IF($AC$7=\"SP\",VLOOKUP($AA52,PARTS!$C:$F,3,0),VLOOKUP($AA52,PARTS!$C:$F,4,0)))","v":""}]
[null,null,null,null,null,{"$f":"IF(L53=\"X\",MAX($F$9:F52)+1,\"\")","v":""},"E. DRIVE TRAIN",null,null,null,null,null,null,"",41,"","","","","",{"$f":"_xlfn.IFNA(IF(P53=\"\",\"\",IF(S53=\"DW\",VLOOKUP(T53,LIST!$A$2:$B$5,2,0)+VLOOKUP($P53,$F:$K,6,0),VLOOKUP($P53,$F:$K,6,0)*T53)),\"\")","v":""},"","",null,{"$f":"IF(ISBLANK(Z53),\"\",MAX($Y$13:Y52)+1)","v":""},null,null,{"$f":"IF(ISBLANK(AA53),\"\",VLOOKUP($AA53,PARTS!$C:$F,2,0))","v":""},null,{"$f":"IF(ISBLANK(AA53),\"\",IF($AC$7=\"SP\",VLOOKUP($AA53,PARTS!$C:$F,3,0),VLOOKUP($AA53,PARTS!$C:$F,4,0)))","v":""}]
[null,null,null,null,null,{"$f":"IF(L54=\"X\",MAX($F$9:F53)+1,\"\")","v":""},"CODE","SERVICE WORK","REMARKS","VALUE","WU","WORK PERFORMED",null,"",42,"","","","","",{"$f":"_xlfn.IFNA(IF(P54=\"\",\"\",IF(S54=\"DW\",VLOOKUP(T54,LIST!$A$2:$B$5,2,0)+VLOOKUP($P54,$F:$K,6,0),VLOOKUP($P54,$F:$K,6,0)*T54)),\"\")","v":""},"","",null,{"$f":"IF(ISBLANK(Z54),\"\",MAX($Y$13:Y53)+1)","v":""},null,null,{"$f":"IF(ISBLANK(AA54),\"\",VLOOKUP($AA54,PARTS!$C:$F,2,0))","v":""},null,{"$f":"IF(ISBLANK(AA54),\"\",IF($AC$7=\"SP\",VLOOKUP($AA54,PARTS!$C:$F,3,0),VLOOKUP($AA54,PARTS!$C:$F,4,0)))","v":""}]
[null,null,null,null,null,{"$f":"IF(L55=\"X\",MAX($F$9:F54)+1,\"\")","v":""},"E010","Checking the condition of the drive",null,1,1,null,null,"",43,"","","","","",{"$f":"_xlfn.IFNA(IF(P55=\"\",\"\",IF(S55=\"DW\",VLOOKUP(T55,LIST!$A$2:$B$5,2,0)+VLOOKUP($P55,$F:$K,6,0),VLOOKUP($P55,$F:$K,6,0)*T55)),\"\")","v":""},"","",null,{"$f":"IF(ISBLANK(Z55),\"\",MAX($Y$13:Y54)+1)","v":""},null,null,{"$f":"IF(ISBLANK(AA55),\"\",VLOOKUP($AA55,PARTS!$C:$F,2,0))","v":""},null,{"$f":"IF(ISBLANK(AA55),\"\",IF($AC$7=\"SP\",VLOOKUP($AA55,PARTS!$C:$F,3,0),VLOOKUP($AA55,PARTS!$C:$F,4,0)))","v":""}]
[null,null,null,null,null,{"$f":"IF(L56=\"X\",MAX($F$9:F55)+1,\"\")","v":""},"E020","Crank replacement","QTY",1,1,null,null,"",44,"","","","","",{"$f":"_xlfn.IFNA(IF(P56=\"\",\"\",IF(S56=\"DW\",VLOOKUP(T56,LIST!$A$2:$B$5,2,0)+VLOOKUP($P56,$F:$K,6,0),VLOOKUP($P56,$F:$K,6,0)*T56)),\"\")","v":""},"","",null,{"$f":"IF(ISBLANK(Z56),\"\",MAX($Y$13:Y55)+1)","v":""},null,null,{"$f":"IF(ISBLANK(AA56),\"\",VLOOKUP($AA56,PARTS!$C:$F,2,0))","v":""},null,{"$f":"IF(ISBLANK(AA56),\"\",IF($AC$7=\"SP\",VLOOKUP($AA56,PARTS!$C:$F,3,0),VLOOKUP($AA56,PARTS!$C:$F,4,0)))","v":""}]
[null,null,null,null,null,{"$f":"IF(L57=\"X\",MAX($F$9:F56)+1,\"\")","v":""},"E030","Front sprocket replacement",null,1,1.5,null,null,"",45,"","","","","",{"$f":"_xlfn.IFNA(IF(P57=\"\",\"\",IF(S57=\"DW\",VLOOKUP(T57,LIST!$A$2:$B$5,2,0)+VLOOKUP($P57,$F:$K,6,0),VLOOKUP($P57,$F:$K,6,0)*T57)),\"\")","v":""},"","",null,{"$f":"IF(ISBLANK(Z57),\"\",MAX($Y$13:Y56)+1)","v":""},null,null,{"$f":"IF(ISBLANK(AA57),\"\",VLOOKUP($AA57,PARTS!$C:$F,2,0))","v":""},null,{"$f":"IF(ISBLANK(AA57),\"\",IF($AC$7=\"SP\",VLOOKUP($AA57,PARTS!$C:$F,3,0),VLOOKUP($AA57,PARTS!$C:$F,4,0)))","v":""}]
[null,null,null,null,null,{"$f":"IF(L58=\"X\",MAX($F$9:F57)+1,\"\")","v":""},"E040","Chain replacement",null,1,1,null,null,"",46,"","","","","",{"$f":"_xlfn.IFNA(IF(P58=\"\",\"\",IF(S58=\"DW\",VLOOKUP(T58,LIST!$A$2:$B$5,2,0)+VLOOKUP($P58,$F:$K,6,0),VLOOKUP($P58,$F:$K,6,0)*T58)),\"\")","v":""},"","",null,{"$f":"IF(ISBLANK(Z58),\"\",MAX($Y$13:Y57)+1)","v":""},null,null,{"$f":"IF(ISBLANK(AA58),\"\",VLOOKUP($AA58,PARTS!$C:$F,2,0))","v":""},null,{"$f":"IF(ISBLANK(AA58),\"\",IF($AC$7=\"SP\",VLOOKUP($AA58,PARTS!$C:$F,3,0),VLOOKUP($AA58,PARTS!$C:$F,4,0)))","v":""}]
[null,null,null,null,null,{"$f":"IF(L59=\"X\",MAX($F$9:F58)+1,\"\")","v":""},"E050","Belt replacement",null,1,3,null,null,"",47,"","","","","",{"$f":"_xlfn.IFNA(IF(P59=\"\",\"\",IF(S59=\"DW\",VLOOKUP(T59,LIST!$A$2:$B$5,2,0)+VLOOKUP($P59,$F:$K,6,0),VLOOKUP($P59,$F:$K,6,0)*T59)),\"\")","v":""},"","",null,{"$f":"IF(ISBLANK(Z59),\"\",MAX($Y$13:Y58)+1)","v":""},null,null,{"$f":"IF(ISBLANK(AA59),\"\",VLOOKUP($AA59,PARTS!$C:$F,2,0))","v":""},null,{"$f":"IF(ISBLANK(AA59),\"\",IF($AC$7=\"SP\",VLOOKUP($AA59,PARTS!$C:$F,3,0),VLOOKUP($AA59,PARTS!$C:$F,4,0)))","v":""}]
[null,null,null,null,null,{"$f":"IF(L60=\"X\",MAX($F$9:F59)+1,\"\")","v":""},"E060","Chain lubrication",null,1,0.5,null,null,"",48,"","","","","",{"$f":"_xlfn.IFNA(IF(P60=\"\",\"\",IF(S60=\"DW\",VLOOKUP(T60,LIST!$A$2:$B$5,2,0)+VLOOKUP($P60,$F:$K,6,0),VLOOKUP($P60,$F:$K,6,0)*T60)),\"\")","v":""},"","",null,{"$f":"IF(ISBLANK(Z60),\"\",MAX($Y$13:Y59)+1)","v":""},null,null,{"$f":"IF(ISBLANK(AA60),\"\",VLOOKUP($AA60,PARTS!$C:$F,2,0))","v":""},null,{"$f":"IF(ISBLANK(AA60),\"\",IF($AC$7=\"SP\",VLOOKUP($AA60,PARTS!$C:$F,3,0),VLOOKUP($AA60,PARTS!$C:$F,4,0)))","v":""}]
[null,null,null,null,null,{"$f":"IF(L61=\"X\",MAX($F$9:F60)+1,\"\")","v":""},"E070","Derailleur replacement",null,1,2,null,null,"",49,"","","","","",{"$f":"_xlfn.IFNA(IF(P61=\"\",\"\",IF(S61=\"DW\",VLOOKUP(T61,LIST!$A$2:$B$5,2,0)+VLOOKUP($P61,$F:$K,6,0),VLOOKUP($P61,$F:$K,6,0)*T61)),\"\")","v":""},"","",null,{"$f":"IF(ISBLANK(Z61),\"\",MAX($Y$13:Y60)+1)","v":""},null,null,{"$f":"IF(ISBLANK(AA61),\"\",VLOOKUP($AA61,PARTS!$C:$F,2,0))","v":""},null,{"$f":"IF(ISBLANK(AA61),\"\",IF($AC$7=\"SP\",VLOOKUP($AA61,PARTS!$C:$F,3,0),VLOOKUP($AA61,PARTS!$C:$F,4,0)))","v":""}]
[null,null,null,null,null,{"$f":"IF(L62=\"X\",MAX($F$9:F61)+1,\"\")","v":""},"E080","Derailleur repair","DW",1,2,null,null,"",50,"","","","","",{"$f":"_xlfn.IFNA(IF(P62=\"\",\"\",IF(S62=\"DW\",VLOOKUP(T62,LIST!$A$2:$B$5,2,0)+VLOOKUP($P62,$F:$K,6,0),VLOOKUP($P62,$F:$K,6,0)*T62)),\"\")","v":""},"","",null,{"$f":"IF(ISBLANK(Z62),\"\",MAX($Y$13:Y61)+1)","v":""},null,null,{"$f":"IF(ISBLANK(AA62),\"\",VLOOKUP($AA62,PARTS!$C:$F,2,0))","v":""},null,{"$f":"IF(ISBLANK(AA62),\"\",IF($AC$7=\"SP\",VLOOKUP($AA62,PARTS!$C:$F,3,0),VLOOKUP($AA62,PARTS!$C:$F,4,0)))","v":""}]
[null,null,null,null,null,{"$f":"IF(L63=\"X\",MAX($F$9:F62)+1,\"\")","v":""},"E090","Shifting cable replacement",null,1,2,null,null,"",51,"","","","","",{"$f":"_xlfn.IFNA(IF(P63=\"\",\"\",IF(S63=\"DW\",VLOOKUP(T63,LIST!$A$2:$B$5,2,0)+VLOOKUP($P63,$F:$K,6,0),VLOOKUP($P63,$F:$K,6,0)*T63)),\"\")","v":""},"","",null,{"$f":"IF(ISBLANK(Z63),\"\",MAX($Y$13:Y62)+1)","v":""},null,null,{"$f":"IF(ISBLANK(AA63),\"\",VLOOKUP($AA63,PARTS!$C:$F,2,0))","v":""},null,{"$f":"IF(ISBLANK(AA63),\"\",IF($AC$7=\"SP\",VLOOKUP($AA63,PARTS!$C:$F,3,0),VLOOKUP($AA63,PARTS!$C:$F,4,0)))","v":""}]
[null,null,null,null,null,{"$f":"IF(L64=\"X\",MAX($F$9:F63)+1,\"\")","v":""},"E100","Cable casing replacement","DW",1,10,null,null,"",52,"","","","","",{"$f":"_xlfn.IFNA(IF(P64=\"\",\"\",IF(S64=\"DW\",VLOOKUP(T64,LIST!$A$2:$B$5,2,0)+VLOOKUP($P64,$F:$K,6,0),VLOOKUP($P64,$F:$K,6,0)*T64)),\"\")","v":""},"","",null,{"$f":"IF(ISBLANK(Z64),\"\",MAX($Y$13:Y63)+1)","v":""},null,null,{"$f":"IF(ISBLANK(AA64),\"\",VLOOKUP($AA64,PARTS!$C:$F,2,0))","v":""},null,{"$f":"IF(ISBLANK(AA64),\"\",IF($AC$7=\"SP\",VLOOKUP($AA64,PARTS!$C:$F,3,0),VLOOKUP($AA64,PARTS!$C:$F,4,0)))","v":""}]
[null,null,null,null,null,{"$f":"IF(L65=\"X\",MAX($F$9:F64)+1,\"\")","v":""},"E110","Play of the bearings in the bottom bracket cassette adjustment",null,1,3,null,null,"",53,"","","","","",{"$f":"_xlfn.IFNA(IF(P65=\"\",\"\",IF(S65=\"DW\",VLOOKUP(T65,LIST!$A$2:$B$5,2,0)+VLOOKUP($P65,$F:$K,6,0),VLOOKUP($P65,$F:$K,6,0)*T65)),\"\")","v":""},"","",null,{"$f":"IF(ISBLANK(Z65),\"\",MAX($Y$13:Y64)+1)","v":""},null,null,{"$f":"IF(ISBLANK(AA65),\"\",VLOOKUP($AA65,PARTS!$C:$F,2,0))","v":""},null,{"$f":"IF(ISBLANK(AA65),\"\",IF($AC$7=\"SP\",VLOOKUP($AA65,PARTS!$C:$F,3,0),VLOOKUP($AA65,PARTS!$C:$F,4,0)))","v":""}]
[null,null,null,null,null,{"$f":"IF(L66=\"X\",MAX($F$9:F65)+1,\"\")","v":""},"E120","Bottom bracket cassette replacement",null,1,5,null,null,"",54,"","","","","",{"$f":"_xlfn.IFNA(IF(P66=\"\",\"\",IF(S66=\"DW\",VLOOKUP(T66,LIST!$A$2:$B$5,2,0)+VLOOKUP($P66,$F:$K,6,0),VLOOKUP($P66,$F:$K,6,0)*T66)),\"\")","v":""},"","",null,{"$f":"IF(ISBLANK(Z66),\"\",MAX($Y$13:Y65)+1)","v":""},null,null,{"$f":"IF(ISBLANK(AA66),\"\",VLOOKUP($AA66,PARTS!$C:$F,2,0))","v":""},null,{"$f":"IF(ISBLANK(AA66),\"\",IF($AC$7=\"SP\",VLOOKUP($AA66,PARTS!$C:$F,3,0),VLOOKUP($AA66,PARTS!$C:$F,4,0)))","v":""}]
[null,null,null,null,null,{"$f":"IF(L67=\"X\",MAX($F$9:F66)+1,\"\")","v":""},"E130","Bottom bracket shells replacement",null,1,5,null,null,"",55,"","","","","",{"$f":"_xlfn.IFNA(IF(P67=\"\",\"\",IF(S67=\"DW\",VLOOKUP(T67,LIST!$A$2:$B$5,2,0)+VLOOKUP($P67,$F:$K,6,0),VLOOKUP($P67,$F:$K,6,0)*T67)),\"\")","v":""},"","",null,{"$f":"IF(ISBLANK(Z67),\"\",MAX($Y$13:Y66)+1)","v":""},null,null,{"$f":"IF(ISBLANK(AA67),\"\",VLOOKUP($AA67,PARTS!$C:$F,2,0))","v":""},null,{"$f":"IF(ISBLANK(AA67),\"\",IF($AC$7=\"SP\",VLOOKUP($AA67,PARTS!$C:$F,3,0),VLOOKUP($AA67,PARTS!$C:$F,4,0)))","v":""}]
[null,null,null,null,null,{"$f":"IF(L68=\"X\",MAX($F$9:F67)+1,\"\")","v":""},"E140","Derailleur adjustment","DW",1,1,null,null,"",56,"","","","","",{"$f":"_xlfn.IFNA(IF(P68=\"\",\"\",IF(S68=\"DW\",VLOOKUP(T68,LIST!$A$2:$B$5,2,0)+VLOOKUP($P68,$F:$K,6,0),VLOOKUP($P68,$F:$K,6,0)*T68)),\"\")","v":""},"","",null,{"$f":"IF(ISBLANK(Z68),\"\",MAX($Y$13:Y67)+1)","v":""},null,null,{"$f":"IF(ISBLANK(AA68),\"\",VLOOKUP($AA68,PARTS!$C:$F,2,0))","v":""},null,{"$f":"IF(ISBLANK(AA68),\"\",IF($AC$7=\"SP\",VLOOKUP($AA68,PARTS!$C:$F,3,0),VLOOKUP($AA68,PARTS!$C:$F,4,0)))","v":""}]
[null,null,null,null,null,{"$f":"IF(L69=\"X\",MAX($F$9:F68)+1,\"\")","v":""},"E141","Belt tension adjustment",null,1,1,null,null,"",57,"","","","","",{"$f":"_xlfn.IFNA(IF(P69=\"\",\"\",IF(S69=\"DW\",VLOOKUP(T69,LIST!$A$2:$B$5,2,0)+VLOOKUP($P69,$F:$K,6,0),VLOOKUP($P69,$F:$K,6,0)*T69)),\"\")","v":""},"","",null,{"$f":"IF(ISBLANK(Z69),\"\",MAX($Y$13:Y68)+1)","v":""},null,null,{"$f":"IF(ISBLANK(AA69),\"\",VLOOKUP($AA69,PARTS!$C:$F,2,0))","v":""},null,{"$f":"IF(ISBLANK(AA69),\"\",IF($AC$7=\"SP\",VLOOKUP($AA69,PARTS!$C:$F,3,0),VLOOKUP($AA69,PARTS!$C:$F,4,0)))","v":""}]
[null,null,null,null,null,{"$f":"IF(L70=\"X\",MAX($F$9:F69)+1,\"\")","v":""},"E142","Wheel alignment in the frame",null,1,1,null,null,"",58,"","","","","",{"$f":"_xlfn.IFNA(IF(P70=\"\",\"\",IF(S70=\"DW\",VLOOKUP(T70,LIST!$A$2:$B$5,2,0)+VLOOKUP($P70,$F:$K,6,0),VLOOKUP($P70,$F:$K,6,0)*T70)),\"\")","v":""},"","",null,{"$f":"IF(ISBLANK(Z70),\"\",MAX($Y$13:Y69)+1)","v":""},null,null,{"$f":"IF(ISBLANK(AA70),\"\",VLOOKUP($AA70,PARTS!$C:$F,2,0))","v":""},null,{"$f":"IF(ISBLANK(AA70),\"\",IF($AC$7=\"SP\",VLOOKUP($AA70,PARTS!$C:$F,3,0),VLOOKUP($AA70,PARTS!$C:$F,4,0)))","v":""}]
[null,null,null,null,null,{"$f":"IF(L71=\"X\",MAX($F$9:F70)+1,\"\")","v":""},"E143","Wheel alignment in the fork",null,1,1,null,null,"",59,"","","","","",{"$f":"_xlfn.IFNA(IF(P71=\"\",\"\",IF(S71=\"DW\",VLOOKUP(T71,LIST!$A$2:$B$5,2,0)+VLOOKUP($P71,$F:$K,6,0),VLOOKUP($P71,$F:$K,6,0)*T71)),\"\")","v":""},"","",null,{"$f":"IF(ISBLANK(Z71),\"\",MAX($Y$13:Y70)+1)","v":""},null,null,{"$f":"IF(ISBLANK(AA71),\"\",VLOOKUP($AA71,PARTS!$C:$F,2,0))","v":""},null,{"$f":"IF(ISBLANK(AA71),\"\",IF($AC$7=\"SP\",VLOOKUP($AA71,PARTS!$C:$F,3,0),VLOOKUP($AA71,PARTS!$C:$F,4,0)))","v":""}]
[null,null,null,null,null,{"$f":"IF(L72=\"X\",MAX($F$9:F71)+1,\"\")","v":""},"BRAKE SYSTEM",null,null,null,null,null,null,"",60,"","","","","",{"$f":"_xlfn.IFNA(IF(P72=\"\",\"\",IF(S72=\"DW\",VLOOKUP(T72,LIST!$A$2:$B$5,2,0)+VLOOKUP($P72,$F:$K,6,0),VLOOKUP($P72,$F:$K,6,0)*T72)),\"\")","v":""},"","",null,{"$f":"IF(ISBLANK(Z72),\"\",MAX($Y$13:Y71)+1)","v":""},null,null,{"$f":"IF(ISBLANK(AA72),\"\",VLOOKUP($AA72,PARTS!$C:$F,2,0))","v":""},null,{"$f":"IF(ISBLANK(AA72),\"\",IF($AC$7=\"SP\",VLOOKUP($AA72,PARTS!$C:$F,3,0),VLOOKUP($AA72,PARTS!$C:$F,4,0)))","v":""}]
[null,null,null,null,null,{"$f":"IF(L73=\"X\",MAX($F$9:F72)+1,\"\")","v":""},"CODE","SERVICE WORK","REMARKS","VALUE","WU","WORK PERFORMED",null,"",61,"","","","","",{"$f":"_xlfn.IFNA(IF(P73=\"\",\"\",IF(S73=\"DW\",VLOOKUP(T73,LIST!$A$2:$B$5,2,0)+VLOOKUP($P73,$F:$K,6,0),VLOOKUP($P73,$F:$K,6,0)*T73)),\"\")","v":""},"","",null,{"$f":"IF(ISBLANK(Z73),\"\",MAX($Y$13:Y72)+1)","v":""},null,null,{"$f":"IF(ISBLANK(AA73),\"\",VLOOKUP($AA73,PARTS!$C:$F,2,0))","v":""},null,{"$f":"IF(ISBLANK(AA73),\"\",IF($AC$7=\"SP\",VLOOKUP($AA73,PARTS!$C:$F,3,0),VLOOKUP($AA73,PARTS!$C:$F,4,0)))","v":""}]
[null,null,null,null,null,{"$f":"IF(L74=\"X\",MAX($F$9:F73)+1,\"\")","v":""},"F010","Checking the braking system",null,1,1,null,null,"",62,"","","","","",{"$f":"_xlfn.IFNA(IF(P74=\"\",\"\",IF(S74=\"DW\",VLOOKUP(T74,LIST!$A$2:$B$5,2,0)+VLOOKUP($P74,$F:$K,6,0),VLOOKUP($P74,$F:$K,6,0)*T74)),\"\")","v":""},"","",null,{"$f":"IF(ISBLANK(Z74),\"\",MAX($Y$13:Y73)+1)","v":""},null,null,{"$f":"IF(ISBLANK(AA74),\"\",VLOOKUP($AA74,PARTS!$C:$F,2,0))","v":""},null,{"$f":"IF(ISBLANK(AA74),\"\",IF($AC$7=\"SP\",VLOOKUP($AA74,PARTS!$C:$F,3,0),VLOOKUP($AA74,PARTS!$C:$F,4,0)))","v":""}]
[null,null,null,null,null,{"$f":"IF(L75=\"X\",MAX($F$9:F74)+1,\"\")","v":""},"F020","Brake caliper replacement","QTY",1,2,null,null,"",63,"","","","","",{"$f":"_xlfn.IFNA(IF(P75=\"\",\"\",IF(S75=\"DW\",VLOOKUP(T75,LIST!$A$2:$B$5,2,0)+VLOOKUP($P75,$F:$K,6,0),VLOOKUP($P75,$F:$K,6,0)*T75)),\"\")","v":""},"",null,null,null,null,null,{"$f":"IF(ISBLANK(AA75),\"\",VLOOKUP($AA75,PARTS!$C:$F,2,0))","v":""},null,{"$f":"IF(ISBLANK(AA75),\"\",IF($AC$7=\"SP\",VLOOKUP($AA75,PARTS!$C:$F,3,0),VLOOKUP($AA75,PARTS!$C:$F,4,0)))","v":""}]
[null,null,null,null,null,{"$f":"IF(L76=\"X\",MAX($F$9:F75)+1,\"\")","v":""},"F030","Brake caliper adjustment","QTY",1,1.5,null,null,{"$f":"IF(P76=\"\",\"\",IF(N75=\"s\",\"z\",\"s\"))","v":""},64,"","","","","",{"$f":"_xlfn.IFNA(IF(P76=\"\",\"\",IF(S76=\"DW\",VLOOKUP(T76,LIST!$A$2:$B$5,2,0)+VLOOKUP($P76,$F:$K,6,0),VLOOKUP($P76,$F:$K,6,0)*T76)),\"\")","v":""},"",null,null,null,null,null,{"$f":"IF(ISBLANK(AA76),\"\",VLOOKUP($AA76,PARTS!$C:$F,2,0))","v":""},null,{"$f":"IF(ISBLANK(AA76),\"\",IF($AC$7=\"SP\",VLOOKUP($AA76,PARTS!$C:$F,3,0),VLOOKUP($AA76,PARTS!$C:$F,4,0)))","v":""}]
[null,null,null,null,null,{"$f":"IF(L77=\"X\",MAX($F$9:F76)+1,\"\")","v":""},"F040","Font brake hose replacement",null,1,3,null,null,"",65,{"$f":"_xlfn.IFNA(VLOOKUP($O77,F:F,1,0),\"\")","v":""},{"$f":"_xlfn.IFNA(VLOOKUP($O77,$F:$K,2,0),\"\")","v":""},{"$f":"_xlfn.IFNA(VLOOKUP($O77,F:L,3,0),\"\")","v":""},{"$f":"_xlfn.IFNA(IF(ISBLANK(VLOOKUP($O77,$F:$K,4,0)),\"\",VLOOKUP($O77,$F:$K,4,0)),\"\")","v":""},{"$f":"_xlfn.IFNA(IF(ISBLANK(VLOOKUP($O77,$F:$K,5,0)),\"\",VLOOKUP($O77,$F:$K,5,0)),\"\")","v":""},{"$f":"_xlfn.IFNA(IF(P77=\"\",\"\",IF(S77=\"DW\",VLOOKUP(T77,LIST!$A$2:$B$5,2,0)+VLOOKUP($P77,$F:$K,6,0),VLOOKUP($P77,$F:$K,6,0)*T77)),\"\")","v":""},{"$f":"IF(U77=\"\",\"\",U77*$C$9)","v":""},null,null,null,null,null,{"$f":"IF(ISBLANK(AA77),\"\",VLOOKUP($AA77,PARTS!$C:$F,2,0))","v":""},null,{"$f":"IF(ISBLANK(AA77),\"\",IF($AC$7=\"SP\",VLOOKUP($AA77,PARTS!$C:$F,3,0),VLOOKUP($AA77,PARTS!$C:$F,4,0)))","v":""}]
[null,null,null,null,null,{"$f":"IF(L78=\"X\",MAX($F$9:F77)+1,\"\")","v":""},"F050","Rear brake hose replacement","DW",1,10,null,null,"",66,"","","","","",{"$f":"_xlfn.IFNA(IF(P78=\"\",\"\",IF(S78=\"DW\",VLOOKUP(T78,LIST!$A$2:$B$5,2,0)+VLOOKUP($P78,$F:$K,6,0),VLOOKUP($P78,$F:$K,6,0)*T78)),\"\")","v":""},"",null,null,null,null,null,{"$f":"IF(ISBLANK(AA78),\"\",VLOOKUP($AA78,PARTS!$C:$F,2,0))","v":""},null,{"$f":"IF(ISBLANK(AA78),\"\",IF($AC$7=\"SP\",VLOOKUP($AA78,PARTS!$C:$F,3,0),VLOOKUP($AA78,PARTS!$C:$F,4,0)))","v":""}]
[null,null,null,null,null,{"$f":"IF(L79=\"X\",MAX($F$9:F78)+1,\"\")","v":""},"F060","Front brake system replacement",null,1,5,null,null,"",67,"","","","","",{"$f":"_xlfn.IFNA(IF(P79=\"\",\"\",IF(S79=\"DW\",VLOOKUP(T79,LIST!$A$2:$B$5,2,0)+VLOOKUP($P79,$F:$K,6,0),VLOOKUP($P79,$F:$K,6,0)*T79)),\"\")","v":""},""]
[null,null,null,null,null,{"$f":"IF(L80=\"X\",MAX($F$9:F79)+1,\"\")","v":""},"F070","Rear brake system replacement","DW",1,12,null,null,{"$f":"IF(P80=\"\",\"\",IF(N79=\"s\",\"z\",\"s\"))","v":""},68,"","","","","",{"$f":"_xlfn.IFNA(IF(P80=\"\",\"\",IF(S80=\"DW\",VLOOKUP(T80,LIST!$A$2:$B$5,2,0)+VLOOKUP($P80,$F:$K,6,0),VLOOKUP($P80,$F:$K,6,0)*T80)),\"\")","v":""},""]
[null,null,null,null,null,{"$f":"IF(L81=\"X\",MAX($F$9:F80)+1,\"\")","v":""},"F080","Disc rotor straightening","QTY",1,1,null,null,"",69,"","","","","",{"$f":"_xlfn.IFNA(IF(P81=\"\",\"\",IF(S81=\"DW\",VLOOKUP(T81,LIST!$A$2:$B$5,2,0)+VLOOKUP($P81,$F:$K,6,0),VLOOKUP($P81,$F:$K,6,0)*T81)),\"\")","v":""},""]
[null,null,null,null,null,{"$f":"IF(L82=\"X\",MAX($F$9:F81)+1,\"\")","v":""},"F090","Disc rotor cleaning","QTY",1,1,null,null,"",70,"","","","","",{"$f":"_xlfn.IFNA(IF(P82=\"\",\"\",IF(S82=\"DW\",VLOOKUP(T82,LIST!$A$2:$B$5,2,0)+VLOOKUP($P82,$F:$K,6,0),VLOOKUP($P82,$F:$K,6,0)*T82)),\"\")","v":""},""]
[null,null,null,null,null,{"$f":"IF(L83=\"X\",MAX($F$9:F82)+1,\"\")","v":""},"F100","Bleeding the brake system","QTY",1,2.5,null,null,"",71,"","","","","",{"$f":"_xlfn.IFNA(IF(P83=\"\",\"\",IF(S83=\"DW\",VLOOKUP(T83,LIST!$A$2:$B$5,2,0)+VLOOKUP($P83,$F:$K,6,0),VLOOKUP($P83,$F:$K,6,0)*T83)),\"\")","v":""},""]
[null,null,null,null,null,{"$f":"IF(L84=\"X\",MAX($F$9:F83)+1,\"\")","v":""},"F110","Brake pads replacement","QTY",1,1.5,null,null,"",72,"","","","","",{"$f":"_xlfn.IFNA(IF(P84=\"\",\"\",IF(S84=\"DW\",VLOOKUP(T84,LIST!$A$2:$B$5,2,0)+VLOOKUP($P84,$F:$K,6,0),VLOOKUP($P84,$F:$K,6,0)*T84)),\"\")","v":""},""]
[null,null,null,null,null,{"$f":"IF(L85=\"X\",MAX($F$9:F84)+1,\"\")","v":""},"G. HANDLEBAR AND STEM",null,null,null,null,null,null,"",73,"","","","","",{"$f":"_xlfn.IFNA(IF(P85=\"\",\"\",IF(S85=\"DW\",VLOOKUP(T85,LIST!$A$2:$B$5,2,0)+VLOOKUP($P85,$F:$K,6,0),VLOOKUP($P85,$F:$K,6,0)*T85)),\"\")","v":""},""]
[null,null,null,null,null,{"$f":"IF(L86=\"X\",MAX($F$9:F85)+1,\"\")","v":""},"CODE","SERVICE WORK","REMARKS","VALUE","WU","WORK PERFORMED",null,"",74,"","","","","",{"$f":"_xlfn.IFNA(IF(P86=\"\",\"\",IF(S86=\"DW\",VLOOKUP(T86,LIST!$A$2:$B$5,2,0)+VLOOKUP($P86,$F:$K,6,0),VLOOKUP($P86,$F:$K,6,0)*T86)),\"\")","v":""},""]
[null,null,null,null,null,{"$f":"IF(L87=\"X\",MAX($F$9:F86)+1,\"\")","v":""},"G010","Handlebar and stem adjustment",null,1,1,null,null,"",75,"","","","","",{"$f":"_xlfn.IFNA(IF(P87=\"\",\"\",IF(S87=\"DW\",VLOOKUP(T87,LIST!$A$2:$B$5,2,0)+VLOOKUP($P87,$F:$K,6,0),VLOOKUP($P87,$F:$K,6,0)*T87)),\"\")","v":""},""]
[null,null,null,null,null,{"$f":"IF(L88=\"X\",MAX($F$9:F87)+1,\"\")","v":""},"G020","Grip angle adjustment","QTY",1,0.5,null,null,"",76,"","","","","",{"$f":"_xlfn.IFNA(IF(P88=\"\",\"\",IF(S88=\"DW\",VLOOKUP(T88,LIST!$A$2:$B$5,2,0)+VLOOKUP($P88,$F:$K,6,0),VLOOKUP($P88,$F:$K,6,0)*T88)),\"\")","v":""},""]
[null,null,null,null,null,{"$f":"IF(L89=\"X\",MAX($F$9:F88)+1,\"\")","v":""},"G030","Brake lever angle adjustment","QTY",1,0.5,null,null,"",77,"","","","","",{"$f":"_xlfn.IFNA(IF(P89=\"\",\"\",IF(S89=\"DW\",VLOOKUP(T89,LIST!$A$2:$B$5,2,0)+VLOOKUP($P89,$F:$K,6,0),VLOOKUP($P89,$F:$K,6,0)*T89)),\"\")","v":""},""]
[null,null,null,null,null,{"$f":"IF(L90=\"X\",MAX($F$9:F89)+1,\"\")","v":""},"G040","Shifting lever angle adjustment",null,1,0.5,null,null,"",78,"","","","","",{"$f":"_xlfn.IFNA(IF(P90=\"\",\"\",IF(S90=\"DW\",VLOOKUP(T90,LIST!$A$2:$B$5,2,0)+VLOOKUP($P90,$F:$K,6,0),VLOOKUP($P90,$F:$K,6,0)*T90)),\"\")","v":""},""]
[null,null,null,null,null,{"$f":"IF(L91=\"X\",MAX($F$9:F90)+1,\"\")","v":""},"G050","Display angle adjustment",null,1,0.5,null,null,"",79,"","","","","",{"$f":"_xlfn.IFNA(IF(P91=\"\",\"\",IF(S91=\"DW\",VLOOKUP(T91,LIST!$A$2:$B$5,2,0)+VLOOKUP($P91,$F:$K,6,0),VLOOKUP($P91,$F:$K,6,0)*T91)),\"\")","v":""},""]
[null,null,null,null,null,{"$f":"IF(L92=\"X\",MAX($F$9:F91)+1,\"\")","v":""},"G060","Bell angle adjustment",null,1,0.5,null,null,"",80,"","","","","",{"$f":"_xlfn.IFNA(IF(P92=\"\",\"\",IF(S92=\"DW\",VLOOKUP(T92,LIST!$A$2:$B$5,2,0)+VLOOKUP($P92,$F:$K,6,0),VLOOKUP($P92,$F:$K,6,0)*T92)),\"\")","v":""},""]
[null,null,null,null,null,{"$f":"IF(L93=\"X\",MAX($F$9:F92)+1,\"\")","v":""},"G070","Handlebar replacement",null,1,5,null,null,"",81,"","","","","",{"$f":"_xlfn.IFNA(IF(P93=\"\",\"\",IF(S93=\"DW\",VLOOKUP(T93,LIST!$A$2:$B$5,2,0)+VLOOKUP($P93,$F:$K,6,0),VLOOKUP($P93,$F:$K,6,0)*T93)),\"\")","v":""},""]
[null,null,null,null,null,{"$f":"IF(L94=\"X\",MAX($F$9:F93)+1,\"\")","v":""},"G080","Stem replacement",null,1,3,null,null,"",82,"","","","","",{"$f":"_xlfn.IFNA(IF(P94=\"\",\"\",IF(S94=\"DW\",VLOOKUP(T94,LIST!$A$2:$B$5,2,0)+VLOOKUP($P94,$F:$K,6,0),VLOOKUP($P94,$F:$K,6,0)*T94)),\"\")","v":""},""]
[null,null,null,null,null,{"$f":"IF(L95=\"X\",MAX($F$9:F94)+1,\"\")","v":""},"G090","Bell replacement",null,1,0.5,null,null,"",83,"","","","","",{"$f":"_xlfn.IFNA(IF(P95=\"\",\"\",IF(S95=\"DW\",VLOOKUP(T95,LIST!$A$2:$B$5,2,0)+VLOOKUP($P95,$F:$K,6,0),VLOOKUP($P95,$F:$K,6,0)*T95)),\"\")","v":""},""]
[null,null,null,null,null,{"$f":"IF(L96=\"X\",MAX($F$9:F95)+1,\"\")","v":""},"G100","Display replacement",null,1,0.5,null,null,"",84,"","","","","",{"$f":"_xlfn.IFNA(IF(P96=\"\",\"\",IF(S96=\"DW\",VLOOKUP(T96,LIST!$A$2:$B$5,2,0)+VLOOKUP($P96,$F:$K,6,0),VLOOKUP($P96,$F:$K,6,0)*T96)),\"\")","v":""},""]
[null,null,null,null,null,{"$f":"IF(L97=\"X\",MAX($F$9:F96)+1,\"\")","v":""},"G110","Shifting lever replacement",null,1,1.5,null,null,"",85,"","","","","",{"$f":"_xlfn.IFNA(IF(P97=\"\",\"\",IF(S97=\"DW\",VLOOKUP(T97,LIST!$A$2:$B$5,2,0)+VLOOKUP($P97,$F:$K,6,0),VLOOKUP($P97,$F:$K,6,0)*T97)),\"\")","v":""},""]
[null,null,null,null,null,{"$f":"IF(L98=\"X\",MAX($F$9:F97)+1,\"\")","v":""},"G120","Brake lever replacement","QTY",1,1.5,null,null,"",86,"","","","","",{"$f":"_xlfn.IFNA(IF(P98=\"\",\"\",IF(S98=\"DW\",VLOOKUP(T98,LIST!$A$2:$B$5,2,0)+VLOOKUP($P98,$F:$K,6,0),VLOOKUP($P98,$F:$K,6,0)*T98)),\"\")","v":""},""]
[null,null,null,null,null,{"$f":"IF(L99=\"X\",MAX($F$9:F98)+1,\"\")","v":""},"G130","Grip replacement","QTY",1,0.5,null,null,"",87,"","","","","",{"$f":"_xlfn.IFNA(IF(P99=\"\",\"\",IF(S99=\"DW\",VLOOKUP(T99,LIST!$A$2:$B$5,2,0)+VLOOKUP($P99,$F:$K,6,0),VLOOKUP($P99,$F:$K,6,0)*T99)),\"\")","v":""},""]
[null,null,null,null,null,{"$f":"IF(L100=\"X\",MAX($F$9:F99)+1,\"\")","v":""},"H. FORK AND HEADSET BEARINGS",null,null,null,null,null,null,"",88,"","","","","",{"$f":"_xlfn.IFNA(IF(P100=\"\",\"\",IF(S100=\"DW\",VLOOKUP(T100,LIST!$A$2:$B$5,2,0)+VLOOKUP($P100,$F:$K,6,0),VLOOKUP($P100,$F:$K,6,0)*T100)),\"\")","v":""},""]
[null,null,null,null,null,{"$f":"IF(L101=\"X\",MAX($F$9:F100)+1,\"\")","v":""},"CODE","SERVICE WORK","REMARKS",null,"WU","WORK PERFORMED",null,"",89,"","","","","",{"$f":"_xlfn.IFNA(IF(P101=\"\",\"\",IF(S101=\"DW\",VLOOKUP(T101,LIST!$A$2:$B$5,2,0)+VLOOKUP($P101,$F:$K,6,0),VLOOKUP($P101,$F:$K,6,0)*T101)),\"\")","v":""},""]
[null,null,null,null,null,{"$f":"IF(L102=\"X\",MAX($F$9:F101)+1,\"\")","v":""},"H010","Checking the operation of the steering system",null,1,1,null,null,"",90,"","","","","",{"$f":"_xlfn.IFNA(IF(P102=\"\",\"\",IF(S102=\"DW\",VLOOKUP(T102,LIST!$A$2:$B$5,2,0)+VLOOKUP($P102,$F:$K,6,0),VLOOKUP($P102,$F:$K,6,0)*T102)),\"\")","v":""},""]
[null,null,null,null,null,{"$f":"IF(L103=\"X\",MAX($F$9:F102)+1,\"\")","v":""},"H020","Play of the headset bearings adjustment",null,1,1,null,null,"",91,"","","","","",{"$f":"_xlfn.IFNA(IF(P103=\"\",\"\",IF(S103=\"DW\",VLOOKUP(T103,LIST!$A$2:$B$5,2,0)+VLOOKUP($P103,$F:$K,6,0),VLOOKUP($P103,$F:$K,6,0)*T103)),\"\")","v":""},""]
[null,null,null,null,null,{"$f":"IF(L104=\"X\",MAX($F$9:F103)+1,\"\")","v":""},"H030","Headset bearings replacement",null,1,3,null,null,"",92,"","","","","",{"$f":"_xlfn.IFNA(IF(P104=\"\",\"\",IF(S104=\"DW\",VLOOKUP(T104,LIST!$A$2:$B$5,2,0)+VLOOKUP($P104,$F:$K,6,0),VLOOKUP($P104,$F:$K,6,0)*T104)),\"\")","v":""},""]
[null,null,null,null,null,{"$f":"IF(L105=\"X\",MAX($F$9:F104)+1,\"\")","v":""},"H040","Headset bearings repair",null,1,4,null,null,"",93,"","","","","",{"$f":"_xlfn.IFNA(IF(P105=\"\",\"\",IF(S105=\"DW\",VLOOKUP(T105,LIST!$A$2:$B$5,2,0)+VLOOKUP($P105,$F:$K,6,0),VLOOKUP($P105,$F:$K,6,0)*T105)),\"\")","v":""},""]
[null,null,null,null,null,{"$f":"IF(L106=\"X\",MAX($F$9:F105)+1,\"\")","v":""},"H050","Headset shells replacement",null,1,3,null,null,"",94,"","","","","",{"$f":"_xlfn.IFNA(IF(P106=\"\",\"\",IF(S106=\"DW\",VLOOKUP(T106,LIST!$A$2:$B$5,2,0)+VLOOKUP($P106,$F:$K,6,0),VLOOKUP($P106,$F:$K,6,0)*T106)),\"\")","v":""},""]
[null,null,null,null,null,{"$f":"IF(L107=\"X\",MAX($F$9:F106)+1,\"\")","v":""},"H060","Fork replacement",null,1,10,null,null,"",95,"","","","","",{"$f":"_xlfn.IFNA(IF(P107=\"\",\"\",IF(S107=\"DW\",VLOOKUP(T107,LIST!$A$2:$B$5,2,0)+VLOOKUP($P107,$F:$K,6,0),VLOOKUP($P107,$F:$K,6,0)*T107)),\"\")","v":""},""]
[null,null,null,null,null,{"$f":"IF(L108=\"X\",MAX($F$9:F107)+1,\"\")","v":""},"I. FRAME",null,null,null,null,null,null,"",96,"","","","","",{"$f":"_xlfn.IFNA(IF(P108=\"\",\"\",IF(S108=\"DW\",VLOOKUP(T108,LIST!$A$2:$B$5,2,0)+VLOOKUP($P108,$F:$K,6,0),VLOOKUP($P108,$F:$K,6,0)*T108)),\"\")","v":""},""]
[null,null,null,null,null,{"$f":"IF(L109=\"X\",MAX($F$9:F108)+1,\"\")","v":""},"CODE","SERVICE WORK","REMARKS","VALUE","WU","WORK PERFORMED",null,{"$f":"IF(P109=\"\",\"\",IF(N108=\"s\",\"z\",\"s\"))","v":""},97,{"$f":"_xlfn.IFNA(VLOOKUP($O109,F:F,1,0),\"\")","v":""},{"$f":"_xlfn.IFNA(VLOOKUP($O109,$F:$K,2,0),\"\")","v":""},{"$f":"_xlfn.IFNA(VLOOKUP($O109,F:L,3,0),\"\")","v":""},{"$f":"_xlfn.IFNA(IF(ISBLANK(VLOOKUP($O109,$F:$K,4,0)),\"\",VLOOKUP($O109,$F:$K,4,0)),\"\")","v":""},{"$f":"_xlfn.IFNA(IF(ISBLANK(VLOOKUP($O109,$F:$K,5,0)),\"\",VLOOKUP($O109,$F:$K,5,0)),\"\")","v":""},{"$f":"_xlfn.IFNA(IF(P109=\"\",\"\",IF(S109=\"DW\",VLOOKUP(T109,LIST!$A$2:$B$5,2,0)+VLOOKUP($P109,$F:$K,6,0),VLOOKUP($P109,$F:$K,6,0)*T109)),\"\")","v":""},""]
[null,null,null,null,null,{"$f":"IF(L110=\"X\",MAX($F$9:F109)+1,\"\")","v":""},"I010","Small threads repair","QTY",1,1,null,null,"",98,"","","","","",{"$f":"_xlfn.IFNA(IF(P110=\"\",\"\",IF(S110=\"DW\",VLOOKUP(T110,LIST!$A$2:$B$5,2,0)+VLOOKUP($P110,$F:$K,6,0),VLOOKUP($P110,$F:$K,6,0)*T110)),\"\")","v":""},""]
[null,null,null,null,null,{"$f":"IF(L111=\"X\",MAX($F$9:F110)+1,\"\")","v":""},"I020","Seat tube mealling",null,1,3,null,null,"",99,"","","","","",{"$f":"_xlfn.IFNA(IF(P111=\"\",\"\",IF(S111=\"DW\",VLOOKUP(T111,LIST!$A$2:$B$5,2,0)+VLOOKUP($P111,$F:$K,6,0),VLOOKUP($P111,$F:$K,6,0)*T111)),\"\")","v":""},""]
[null,null,null,null,null,{"$f":"IF(L112=\"X\",MAX($F$9:F111)+1,\"\")","v":""},"I030","Hook inspection",null,1,1,null,null,"",100,"","","","","",{"$f":"_xlfn.IFNA(IF(P112=\"\",\"\",IF(S112=\"DW\",VLOOKUP(T112,LIST!$A$2:$B$5,2,0)+VLOOKUP($P112,$F:$K,6,0),VLOOKUP($P112,$F:$K,6,0)*T112)),\"\")","v":""},""]
[null,null,null,null,null,{"$f":"IF(L113=\"X\",MAX($F$9:F112)+1,\"\")","v":""},"I040","Hook replacement","QTY",1,5,null,null,"",101,"","","","","",{"$f":"_xlfn.IFNA(IF(P113=\"\",\"\",IF(S113=\"DW\",VLOOKUP(T113,LIST!$A$2:$B$5,2,0)+VLOOKUP($P113,$F:$K,6,0),VLOOKUP($P113,$F:$K,6,0)*T113)),\"\")","v":""},""]
[null,null,null,null,null,{"$f":"IF(L114=\"X\",MAX($F$9:F113)+1,\"\")","v":""},"I050","Bottom bracket sleeve thread repair",null,1,1.5,null,null,"",102,"","","","","",{"$f":"_xlfn.IFNA(IF(P114=\"\",\"\",IF(S114=\"DW\",VLOOKUP(T114,LIST!$A$2:$B$5,2,0)+VLOOKUP($P114,$F:$K,6,0),VLOOKUP($P114,$F:$K,6,0)*T114)),\"\")","v":""},""]
[null,null,null,null,null,{"$f":"IF(L115=\"X\",MAX($F$9:F114)+1,\"\")","v":""},"J. ELECTRONICS",null,null,null,null,null,null,"",103,"","","","","",{"$f":"_xlfn.IFNA(IF(P115=\"\",\"\",IF(S115=\"DW\",VLOOKUP(T115,LIST!$A$2:$B$5,2,0)+VLOOKUP($P115,$F:$K,6,0),VLOOKUP($P115,$F:$K,6,0)*T115)),\"\")","v":""},""]
[null,null,null,null,null,{"$f":"IF(L116=\"X\",MAX($F$9:F115)+1,\"\")","v":""},"CODE","SERVICE WORK","REMARKS","VALUE","WU","WORK PERFORMED",null,"",104,"","","","","",{"$f":"_xlfn.IFNA(IF(P116=\"\",\"\",IF(S116=\"DW\",VLOOKUP(T116,LIST!$A$2:$B$5,2,0)+VLOOKUP($P116,$F:$K,6,0),VLOOKUP($P116,$F:$K,6,0)*T116)),\"\")","v":""},""]
[null,null,null,null,null,{"$f":"IF(L117=\"X\",MAX($F$9:F116)+1,\"\")","v":5},"J010","Controller replacement","QTY",1,7,"x",null,{"$f":"IF(P117=\"\",\"\",IF(N116=\"s\",\"z\",\"s\"))","v":""},105,"","","","","",{"$f":"_xlfn.IFNA(IF(P117=\"\",\"\",IF(S117=\"DW\",VLOOKUP(T117,LIST!$A$2:$B$5,2,0)+VLOOKUP($P117,$F:$K,6,0),VLOOKUP($P117,$F:$K,6,0)*T117)),\"\")","v":""},""]
[null,null,null,null,null,{"$f":"IF(L118=\"X\",MAX($F$9:F117)+1,\"\")","v":""},"J020","Battery replacement","QTY",1,10,null,null,"",106,"","","","","",{"$f":"_xlfn.IFNA(IF(P118=\"\",\"\",IF(S118=\"DW\",VLOOKUP(T118,LIST!$A$2:$B$5,2,0)+VLOOKUP($P118,$F:$K,6,0),VLOOKUP($P118,$F:$K,6,0)*T118)),\"\")","v":""},""]
[null,null,null,null,null,{"$f":"IF(L119=\"X\",MAX($F$9:F118)+1,\"\")","v":""},"J030","Charging socket replacement","QTY",1,0.5,null,null,"",107,"","","","","",{"$f":"_xlfn.IFNA(IF(P119=\"\",\"\",IF(S119=\"DW\",VLOOKUP(T119,LIST!$A$2:$B$5,2,0)+VLOOKUP($P119,$F:$K,6,0),VLOOKUP($P119,$F:$K,6,0)*T119)),\"\")","v":""},""]
[null,null,null,null,null,{"$f":"IF(L120=\"X\",MAX($F$9:F119)+1,\"\")","v":""},"J040","Soldering","QTY",1,0.5,null,null,null,108,{"$f":"_xlfn.IFNA(VLOOKUP($O121,F:F,1,0),\"\")","v":""},{"$f":"_xlfn.IFNA(VLOOKUP($O121,$F:$K,2,0),\"\")","v":""},{"$f":"_xlfn.IFNA(VLOOKUP($O121,F:L,3,0),\"\")","v":""},{"$f":"_xlfn.IFNA(IF(ISBLANK(VLOOKUP($O121,$F:$K,4,0)),\"\",VLOOKUP($O121,$F:$K,4,0)),\"\")","v":""},{"$f":"_xlfn.IFNA(IF(ISBLANK(VLOOKUP($O121,$F:$K,5,0)),\"\",VLOOKUP($O121,$F:$K,5,0)),\"\")","v":""},{"$f":"_xlfn.IFNA(IF(P120=\"\",\"\",IF(S120=\"DW\",VLOOKUP(T120,LIST!$A$2:$B$5,2,0)+VLOOKUP($P120,$F:$K,6,0),VLOOKUP($P120,$F:$K,6,0)*T120)),\"\")","v":""},""]
[null,null,null,null,null,{"$f":"IF(L121=\"X\",MAX($F$9:F120)+1,\"\")","v":""},"J050","Electrical parameters checking (multimeter)","QTY",1,0.25,null,null,{"$f":"IF(P120=\"\",\"\",IF(N119=\"s\",\"z\",\"s\"))","v":""},109,"","","","","",{"$f":"_xlfn.IFNA(IF(P121=\"\",\"\",IF(S121=\"DW\",VLOOKUP(T121,LIST!$A$2:$B$5,2,0)+VLOOKUP($P121,$F:$K,6,0),VLOOKUP($P121,$F:$K,6,0)*T121)),\"\")","v":""},""]
[null,null,null,null,null,{"$f":"IF(L122=\"X\",MAX($F$9:F121)+1,\"\")","v":""},"J060","Electrical connection checking (plugs, cables)","QTY",1,0.5,null,null,{"$f":"IF(P121=\"\",\"\",IF(N121=\"s\",\"z\",\"s\"))","v":""},110,"","","","","",{"$f":"_xlfn.IFNA(IF(P122=\"\",\"\",IF(S122=\"DW\",VLOOKUP(T122,LIST!$A$2:$B$5,2,0)+VLOOKUP($P122,$F:$K,6,0),VLOOKUP($P122,$F:$K,6,0)*T122)),\"\")","v":""},""]
[null,null,null,null,null,{"$f":"IF(L123=\"X\",MAX($F$9:F122)+1,\"\")","v":""},"H. OTHER NOT SPECIFIED ABOVE",null,null,null,null,null,null,"",111,"","","","","",{"$f":"_xlfn.IFNA(IF(P123=\"\",\"\",IF(S123=\"DW\",VLOOKUP(T123,LIST!$A$2:$B$5,2,0)+VLOOKUP($P123,$F:$K,6,0),VLOOKUP($P123,$F:$K,6,0)*T123)),\"\")","v":""},""]
[null,null,null,null,null,{"$f":"IF(L124=\"X\",MAX($F$9:F123)+1,\"\")","v":""},"CODE","SERVICE WORK","REMARKS","VALUE","WU","WORK PERFORMED",null,"",112,"","","","","",{"$f":"_xlfn.IFNA(IF(P124=\"\",\"\",IF(S124=\"DW\",VLOOKUP(T124,LIST!$A$2:$B$5,2,0)+VLOOKUP($P124,$F:$K,6,0),VLOOKUP($P124,$F:$K,6,0)*T124)),\"\")","v":""},""]
[null,null,null,null,null,{"$f":"IF(L125=\"X\",MAX($F$9:F124)+1,\"\")","v":""},"H010","not listed work","QTY",2,1,null,null,"",113,"","","","","",{"$f":"_xlfn.IFNA(IF(P125=\"\",\"\",IF(S125=\"DW\",VLOOKUP(T125,LIST!$A$2:$B$5,2,0)+VLOOKUP($P125,$F:$K,6,0),VLOOKUP($P125,$F:$K,6,0)*T125)),\"\")","v":""},""]
[null,null,null,null,null,{"$f":"IF(L126=\"X\",MAX($F$9:F125)+1,\"\")","v":""},"H020",null,null,null,null,null,null,"",114,"","","","","",{"$f":"_xlfn.IFNA(IF(P126=\"\",\"\",IF(S126=\"DW\",VLOOKUP(T126,LIST!$A$2:$B$5,2,0)+VLOOKUP($P126,$F:$K,6,0),VLOOKUP($P126,$F:$K,6,0)*T126)),\"\")","v":""},""]
[null,null,null,null,null,{"$f":"IF(L127=\"X\",MAX($F$9:F126)+1,\"\")","v":""},"H030",null,null,null,null,null,null,"",115,"","","","","",{"$f":"_xlfn.IFNA(IF(P127=\"\",\"\",IF(S127=\"DW\",VLOOKUP(T127,LIST!$A$2:$B$5,2,0)+VLOOKUP($P127,$F:$K,6,0),VLOOKUP($P127,$F:$K,6,0)*T127)),\"\")","v":""},""]
[null,null,null,null,null,{"$f":"IF(L128=\"X\",MAX($F$9:F127)+1,\"\")","v":""},"H040",null,null,null,null,null,null,"",116,"","","","","",{"$f":"_xlfn.IFNA(IF(P128=\"\",\"\",IF(S128=\"DW\",VLOOKUP(T128,LIST!$A$2:$B$5,2,0)+VLOOKUP($P128,$F:$K,6,0),VLOOKUP($P128,$F:$K,6,0)*T128)),\"\")","v":""},""]
[null,null,null,null,null,{"$f":"IF(L129=\"X\",MAX($F$9:F128)+1,\"\")","v":""},"H050",null,null,null,null,null,null,"",117,"","","","","",{"$f":"_xlfn.IFNA(IF(P129=\"\",\"\",IF(S129=\"DW\",VLOOKUP(T129,LIST!$A$2:$B$5,2,0)+VLOOKUP($P129,$F:$K,6,0),VLOOKUP($P129,$F:$K,6,0)*T129)),\"\")","v":""},""]
[null,null,null,null,null,{"$f":"IF(L130=\"X\",MAX($F$9:F129)+1,\"\")","v":""},"H060",null,null,null,null,null,null,"",118,"","","","","",{"$f":"_xlfn.IFNA(IF(P130=\"\",\"\",IF(S130=\"DW\",VLOOKUP(T130,LIST!$A$2:$B$5,2,0)+VLOOKUP($P130,$F:$K,6,0),VLOOKUP($P130,$F:$K,6,0)*T130)),\"\")","v":""},""]
[null,null,null,null,null,{"$f":"IF(L131=\"X\",MAX($F$9:F130)+1,\"\")","v":""},"H070",null,null,null,null,null,null,"",119,"","","","","",{"$f":"_xlfn.IFNA(IF(P131=\"\",\"\",IF(S131=\"DW\",VLOOKUP(T131,LIST!$A$2:$B$5,2,0)+VLOOKUP($P131,$F:$K,6,0),VLOOKUP($P131,$F:$K,6,0)*T131)),\"\")","v":""},""]
[null,null,null,null,null,{"$f":"IF(L132=\"X\",MAX($F$9:F131)+1,\"\")","v":""},"H080",null,null,null,null,null,null,"",120,"","","","","",{"$f":"_xlfn.IFNA(IF(P132=\"\",\"\",IF(S132=\"DW\",VLOOKUP(T132,LIST!$A$2:$B$5,2,0)+VLOOKUP($P132,$F:$K,6,0),VLOOKUP($P132,$F:$K,6,0)*T132)),\"\")","v":""},""]
[null,null,null,null,null,{"$f":"IF(L133=\"X\",MAX($F$9:F132)+1,\"\")","v":""},"H090",null,null,null,null,null,null,"",121,"","","","","",{"$f":"_xlfn.IFNA(IF(P133=\"\",\"\",IF(S133=\"DW\",VLOOKUP(T133,LIST!$A$2:$B$5,2,0)+VLOOKUP($P133,$F:$K,6,0),VLOOKUP($P133,$F:$K,6,0)*T133)),\"\")","v":""},""]
[null,null,null,null,null,{"$f":"IF(L134=\"X\",MAX($F$9:F133)+1,\"\")","v":""},"H100",null,null,null,null,null,null,"",122,"","","","","",{"$f":"_xlfn.IFNA(IF(P134=\"\",\"\",IF(S134=\"DW\",VLOOKUP(T134,LIST!$A$2:$B$5,2,0)+VLOOKUP($P134,$F:$K,6,0),VLOOKUP($P134,$F:$K,6,0)*T134)),\"\")","v":""},""]
[null,null,null,null,null,{"$f":"IF(L135=\"X\",MAX($F$9:F134)+1,\"\")","v":""},"H110",null,null,null,null,null,null,null,123]
[null,null,null,null,null,{"$f":"IF(L136=\"X\",MAX($F$9:F135)+1,\"\")","v":""}]
[null,null,null,null,null,{"$f":"IF(L137=\"X\",MAX($F$9:F136)+1,\"\")","v":""}]
[null,null,null,null,null,{"$f":"IF(L138=\"X\",MAX($F$9:F137)+1,\"\")","v":""}]
[null,null,null,null,null,{"$f":"IF(L139=\"X\",MAX($F$9:F138)+1,\"\")","v":""}]
[null,null,null,null,null,{"$f":"IF(L140=\"X\",MAX($F$9:F139)+1,\"\")","v":""}]
[null,null,null,null,null,{"$f":"IF(L141=\"X\",MAX($F$9:F140)+1,\"\")","v":""}]
[null,null,null,null,null,{"$f":"IF(L142=\"X\",MAX($F$9:F141)+1,\"\")","v":""}]
[null,null,null,null,null,{"$f":"IF(L143=\"X\",MAX($F$9:F142)+1,\"\")","v":""}]
[null,null,null,null,null,{"$f":"IF(L144=\"X\",MAX($F$9:F143)+1,\"\")","v":""}]
[null,null,null,null,null,{"$f":"IF(L145=\"X\",MAX($F$9:F144)+1,\"\")","v":""}]
[null,null,null,null,null,{"$f":"IF(L146=\"X\",MAX($F$9:F145)+1,\"\")","v":""}]
[null,null,null,null,null,{"$f":"IF(L147=\"X\",MAX($F$9:F146)+1,\"\")","v":""}]
[null,null,null,null,null,{"$f":"IF(L148=\"X\",MAX($F$9:F147)+1,\"\")","v":""}]
[null,null,null,null,null,{"$f":"IF(L149=\"X\",MAX($F$9:F148)+1,\"\")","v":""}]
[null,null,null,null,null,{"$f":"IF(L150=\"X\",MAX($F$9:F149)+1,\"\")","v":""}]
[null,null,null,null,null,{"$f":"IF(L151=\"X\",MAX($F$9:F150)+1,\"\")","v":""}]
[null,null,null,null,null,{"$f":"IF(L152=\"X\",MAX($F$9:F151)+1,\"\")","v":""}]
[null,null,null,null,null,{"$f":"IF(L153=\"X\",MAX($F$9:F152)+1,\"\")","v":""}]
[null,null,null,null,null,{"$f":"IF(L154=\"X\",MAX($F$9:F153)+1,\"\")","v":""}]
[null,null,null,null,null,{"$f":"IF(L155=\"X\",MAX($F$9:F154)+1,\"\")","v":""}]
[null,null,null,null,null,{"$f":"IF(L156=\"X\",MAX($F$9:F155)+1,\"\")","v":""}]
[null,null,null,null,null,{"$f":"IF(L157=\"X\",MAX($F$9:F156)+1,\"\")","v":""}]
[null,null,null,null,null,{"$f":"IF(L158=\"X\",MAX($F$9:F157)+1,\"\")","v":""}]
[null,null,null,null,null,{"$f":"IF(L159=\"X\",MAX($F$9:F158)+1,\"\")","v":""}]
[null,null,null,null,null,{"$f":"IF(L160=\"X\",MAX($F$9:F159)+1,\"\")","v":""}]
[null,null,null,null,null,{"$f":"IF(L161=\"X\",MAX($F$9:F160)+1,\"\")","v":""}]
[null,null,null,null,null,{"$f":"IF(L162=\"X\",MAX($F$9:F161)+1,\"\")","v":""}]
[null,null,null,null,null,{"$f":"IF(L163=\"X\",MAX($F$9:F162)+1,\"\")","v":""}]
[null,null,null,null,null,{"$f":"IF(L164=\"X\",MAX($F$9:F163)+1,\"\")","v":""}]
[null,null,null,null,null,{"$f":"IF(L165=\"X\",MAX($F$9:F164)+1,\"\")","v":""}]
[null,null,null,null,null,{"$f":"IF(L166=\"X\",MAX($F$9:F165)+1,\"\")","v":""}]
[null,null,null,null,null,{"$f":"IF(L167=\"X\",MAX($F$9:F166)+1,\"\")","v":""}]
[null,null,null,null,null,{"$f":"IF(L168=\"X\",MAX($F$9:F167)+1,\"\")","v":""}]
[null,null,null,null,null,{"$f":"IF(L169=\"X\",MAX($F$9:F168)+1,\"\")","v":""}]
[null,null,null,null,null,{"$f":"IF(L170=\"X\",MAX($F$9:F169)+1,\"\")","v":""}]
[null,null,null,null,null,{"$f":"IF(L171=\"X\",MAX($F$9:F170)+1,\"\")","v":""}]
[null,null,null,null,null,{"$f":"IF(L172=\"X\",MAX($F$9:F171)+1,\"\")","v":""}]
[null,null,null,null,null,{"$f":"IF(L173=\"X\",MAX($F$9:F172)+1,\"\")","v":""}]
[null,null,null,null,null,{"$f":"IF(L174=\"X\",MAX($F$9:F173)+1,\"\")","v":""}]
[null,null,null,null,null,{"$f":"IF(L175=\"X\",MAX($F$9:F174)+1,\"\")","v":""}]
[null,null,null,null,null,{"$f":"IF(L176=\"X\",MAX($F$9:F175)+1,\"\")","v":""}]
[null,null,null,null,null,{"$f":"IF(L177=\"X\",MAX($F$9:F176)+1,\"\")","v":""}]
[null,null,null,null,null,{"$f":"IF(L178=\"X\",MAX($F$9:F177)+1,\"\")","v":""}]
[null,null,null,null,null,{"$f":"IF(L179=\"X\",MAX($F$9:F178)+1,\"\")","v":""}]
[null,null,null,null,null,{"$f":"IF(L180=\"X\",MAX($F$9:F179)+1,\"\")","v":""}]
[null,null,null,null,null,{"$f":"IF(L181=\"X\",MAX($F$9:F180)+1,\"\")","v":""}]
[null,null,null,null,null,{"$f":"IF(L182=\"X\",MAX($F$9:F181)+1,\"\")","v":""}]
[null,null,null,null,null,{"$f":"IF(L183=\"X\",MAX($F$9:F182)+1,\"\")","v":""}]
[null,null,null,null,null,{"$f":"IF(L184=\"X\",MAX($F$9:F183)+1,\"\")","v":""}]
[null,null,null,null,null,{"$f":"IF(L185=\"X\",MAX($F$9:F184)+1,\"\")","v":""}]
[null,null,null,null,null,{"$f":"IF(L186=\"X\",MAX($F$9:F185)+1,\"\")","v":""}]
[null,null,null,null,null,{"$f":"IF(L187=\"X\",MAX($F$9:F186)+1,\"\")","v":""}]
[null,null,null,null,null,{"$f":"IF(L188=\"X\",MAX($F$9:F187)+1,\"\")","v":""}]
[null,null,null,null,null,{"$f":"IF(L189=\"X\",MAX($F$9:F188)+1,\"\")","v":""}]
[null,null,null,null,null,{"$f":"IF(L190=\"X\",MAX($F$9:F189)+1,\"\")","v":""}]
[null,null,null,null,null,{"$f":"IF(L191=\"X\",MAX($F$9:F190)+1,\"\")","v":""}]
[null,null,null,null,null,{"$f":"IF(L192=\"X\",MAX($F$9:F191)+1,\"\")","v":""}]
[null,null,null,null,null,{"$f":"IF(L193=\"X\",MAX($F$9:F192)+1,\"\")","v":""}]
[null,null,null,null,null,{"$f":"IF(L194=\"X\",MAX($F$9:F193)+1,\"\")","v":""}]
[null,null,null,null,null,{"$f":"IF(L195=\"X\",MAX($F$9:F194)+1,\"\")","v":""}]
[null,null,null,null,null,{"$f":"IF(L196=\"X\",MAX($F$9:F195)+1,\"\")","v":""}]
[null,null,null,null,null,{"$f":"IF(L197=\"X\",MAX($F$9:F196)+1,\"\")","v":""}]
[null,null,null,null,null,{"$f":"IF(L198=\"X\",MAX($F$9:F197)+1,\"\")","v":""}]
[null,null,null,null,null,{"$f":"IF(L199=\"X\",MAX($F$9:F198)+1,\"\")","v":""}]
[null,null,null,null,null,{"$f":"IF(L200=\"X\",MAX($F$9:F199)+1,\"\")","v":""}]
[null,null,null,null,null,{"$f":"IF(L201=\"X\",MAX($F$9:F200)+1,\"\")","v":""}]
[null,null,null,null,null,{"$f":"IF(L202=\"X\",MAX($F$9:F201)+1,\"\")","v":""}]
[null,null,null,null,null,{"$f":"IF(L203=\"X\",MAX($F$9:F202)+1,\"\")","v":""}]
[null,null,null,null,null,{"$f":"IF(L204=\"X\",MAX($F$9:F203)+1,\"\")","v":""}]

{"sheet":"LIST","index":1,"n_rows":39,"n_cols":18,"rows_kept":39,"cut":false,"hidden":true,"merged":[]}
["DW","WU",null,"QTY",null,null,"QTY",null,0.5,null,"cleanliness","AT",null,"Test ride"]
[1,null,null,1,null,null,"DW",null,0.75,null,"BASIC",0,null,"BASIC",0,null,null,"SP"]
[2,2,null,2,null,null,null,null,1,null,"DIRTY",3,null,"LONG",4,null,null,"CUSTOMER"]
[3,3,null,3,null,null,null,null,1.25,null,"VERY DIRTY",6]
[4,4,null,4,null,null,null,null,1.5]
[null,null,null,5,null,null,null,null,1.75]
[null,null,null,6,null,null,null,null,2]
[null,null,null,7,null,null,null,null,2.25]
[null,null,null,8,null,null,null,null,2.5]
[null,null,null,9,null,null,null,null,2.75]
[null,null,null,10,null,null,null,null,3]
[null,null,null,null,null,null,null,null,3.25]
[null,null,null,null,null,null,null,null,3.5]
[null,null,null,null,null,null,null,null,3.75]
[null,null,null,null,null,null,null,null,4]
[null,null,null,null,null,null,null,null,4.25]
[null,null,null,null,null,null,null,null,4.5]
[null,null,null,null,null,null,null,null,4.75]
[null,null,null,null,null,null,null,null,5]
[null,null,null,null,null,null,null,null,5.25]
[null,null,null,null,null,null,null,null,5.5]
[null,null,null,null,null,null,null,null,5.75]
[null,null,null,null,null,null,null,null,6]
[null,null,null,null,null,null,null,null,6.25]
[null,null,null,null,null,null,null,null,6.5]
[null,null,null,null,null,null,null,null,6.75]
[null,null,null,null,null,null,null,null,7]
[null,null,null,null,null,null,null,null,7.25]
[null,null,null,null,null,null,null,null,7.5]
[null,null,null,null,null,null,null,null,7.75]
[null,null,null,null,null,null,null,null,8]
[null,null,null,null,null,null,null,null,8.25]
[null,null,null,null,null,null,null,null,8.5]
[null,null,null,null,null,null,null,null,8.75]
[null,null,null,null,null,null,null,null,9]
[null,null,null,null,null,null,null,null,9.25]
[null,null,null,null,null,null,null,null,9.5]
[null,null,null,null,null,null,null,null,9.75]
[null,null,null,null,null,null,null,null,10]

{"sheet":"PARTS","index":2,"n_rows":252,"n_cols":9,"rows_kept":252,"cut":false,"hidden":true,"merged":[]}
["Nazwa","Opis","ENG","Kod","2023       SP Price Excl VAT","2023 Client price  Excl VAT","Search","IsNumber","Filter"]
[null,null,"PLEASE CHOOSE",null,null,null,{"$f":"SEARCH(MASTER_EN!$AA$13,C:C)","v":1}]
["KLUCZ PŁASKO OCZKOWY 15MM","15MM","15MM SPANNER","KLPO000001",2.4,3.4,{"$f":"SEARCH(MASTER_EN!AA13,C:C)","v":{"$error":"#VALUE!"}}]
["KLUCZ IMBUSOWY  4MM","4MM","4MM ALLEN SPANNER","KLIM000001",0.35,0.5,{"$f":"SEARCH(MASTER_EN!$AA$13,C:C)","v":{"$error":"#VALUE!"}}]
["KLUCZ IMBUSOWY 5MM","5MM","5MM ALLEN SPANNER","KLIM000002",0.7,1,{"$f":"SEARCH(MASTER_EN!$AA$13,C:C)","v":{"$error":"#VALUE!"}}]
["KARTON NA AKCESORIA","KARTON- PUDEŁKO NA AKCESORIA- KLUCZE H-40","ACCESSORIES BOX","KART000005",0.6,0.8,{"$f":"SEARCH(MASTER_EN!$AA$13,C:C)","v":{"$error":"#VALUE!"}}]
["WSPORNIK KIEROWNICY REGULOWANY BRU/LON","ADJUSTABLE STEM DIE CASTING ALLOY FI31,8MM EXT90","ADJUSTABLE STEM BRU/LON","WSKI000007",19.899999999999999,27.9,{"$f":"SEARCH(MASTER_EN!$AA$13,C:C)","v":{"$error":"#VALUE!"}}]
["WSPORNIK KIEROWNICY REGULOWANY VIE","ADJUSTABLE STEM DIE CASTING ALLOY FI31,8MM EXT110","ADJUSTABLE STEM VIE","WSKI000008",19.579439999999998,27.411215999999996,{"$f":"SEARCH(MASTER_EN!$AA$13,C:C)","v":{"$error":"#VALUE!"}}]
["OWIJKA NA KIEROWNICĘ BER","OWIJKA KIEROWNICY EVA HANDLEBAR TAPE, W/2PC PLUGS & STICKERS, EVA FOAM, BLACK","BAR TAPE BER","OWIJ000001",5.1542400000000006,7.2159360000000001,{"$f":"SEARCH(MASTER_EN!$AA$13,C:C)","v":{"$error":"#VALUE!"}}]
["BATERIA GOTOWA 10AH","BATERIA GOTOWA 10AH","BATTERY PREPARED 10AH","BATG000001",280,392,{"$f":"SEARCH(MASTER_EN!$AA$13,C:C)","v":{"$error":"#VALUE!"}}]
["BATERIA GOTOWA 7AH","BATERIA GOTOWA 7AH","BATTERY PREPARED 7AH","BATG000002",195,273,{"$f":"SEARCH(MASTER_EN!$AA$13,C:C)","v":{"$error":"#VALUE!"}}]
["DZWONEK ROCKBROS 2023","BLACK ROCKBROS15-1B","BELL ROCKBROS 2023","DZWO000005",5.5,7.6999999999999993,{"$f":"SEARCH(MASTER_EN!$AA$13,C:C)","v":{"$error":"#VALUE!"}}]
["PASEK 115T AMS","CDX BELT GATES CARBON DRIVE 115T BLACK/BLACK","BELT 115T AMS","PASE000001",61,85.399999999999991,{"$f":"SEARCH(MASTER_EN!$AA$13,C:C)","v":{"$error":"#VALUE!"}}]
["PASEK 118T LON M54/MIL M54","11M-118T-12CT CDN BLACK BULK","BELT 118T LON M54/MIL M54","PASE000002",40,56,{"$f":"SEARCH(MASTER_EN!$AA$13,C:C)","v":{"$error":"#VALUE!"}}]
["PASEK 120T VIE/LON L57/MIL L57","11M-120T-12CT CDN BLACK BULK","BELT 120T VIE/LON L57/MIL L57","PASE000003",40,56,{"$f":"SEARCH(MASTER_EN!$AA$13,C:C)","v":{"$error":"#VALUE!"}}]
["KASETA SUPORTU 148MM/68MM","SR PA211.32.ST.C BB 68MM,150MMG6.5.5, AXLE 148MM","BOTTOM BRACKET CASSETTE 148MM/68MM ","KASS000002",130,182,{"$f":"SEARCH(MASTER_EN!$AA$13,C:C)","v":{"$error":"#VALUE!"}}]
["KASETA SUPORTU SGM 148MM/73MM","SR PA231.32.ST 148MM/73MM","BOTTOM BRACKET CASSETTE 148MM/73MM SGM ","KASS000001",110,154,{"$f":"SEARCH(MASTER_EN!$AA$13,C:C)","v":{"$error":"#VALUE!"}}]
["KARTON SPÓD 2022","KARTON DNO FEFCO 301\"5\"","BOTTOM PACKING BOX 2022","KART000006",3,4.1999999999999993,{"$f":"SEARCH(MASTER_EN!$AA$13,C:C)","v":{"$error":"#VALUE!"}}]
["ADAPTER HAMULCA 160MM","CONVERTER ROAD DISC BRAKE F BULK SM-MA-F16 P/D Ø160","BRAKE ADAPTER 160MM","ADAH000001",13.5,18.899999999999999,{"$f":"SEARCH(MASTER_EN!$AA$13,C:C)","v":{"$error":"#VALUE!"}}]
["KLOCKI HAMULCOWE","HAM SHIELDS B01S CLADDING 25PAR ZICHI","BRAKE PADS","KLHA000001",3.7,5.2,{"$f":"SEARCH(MASTER_EN!$AA$13,C:C)","v":{"$error":"#VALUE!"}}]
["PRZEWÓD GOTOWY DO WSPORNIKA SIODŁA ZE ŚWIATŁAMI","PRZEWÓD GOTOWY DO WSPORNIKA SIODŁA ZE ŚWIATŁAMI","CABLE PREPARED FOR SEATPOST WITH LIGHTS","PRZG000001",19.32,27.047999999999998,{"$f":"SEARCH(MASTER_EN!$AA$13,C:C)","v":{"$error":"#VALUE!"}}]
["WKŁADKA KARTONOWA NA SIODŁO","WKŁADKA KARTONOWA NA SIODŁO","CARDBOARD INSERT FOR SADDLE","WKLA000004",0.87216000000000016,1.2210240000000001,{"$f":"SEARCH(MASTER_EN!$AA$13,C:C)","v":{"$error":"#VALUE!"}}]
["WKŁADKA KARTONOWA NA KOŁO","WKŁADKA KARTONOWA NA KOŁO","CARDBOARD INSERT FOR WHEEL","WKLA000003",2.2576799999999997,3.1607519999999996,{"$f":"SEARCH(MASTER_EN!$AA$13,C:C)","v":{"$error":"#VALUE!"}}]
["KASETA PRZERZUTKI 9 RZĘDÓW","CASSETE SPROCKET HG400 9-SPEED 11-12-14-16-16-21-24-28-32(AR)","CASSETE SPROCKET 9-SPEED","KAPR000001",22.4,31.35,{"$f":"SEARCH(MASTER_EN!$AA$13,C:C)","v":{"$error":"#VALUE!"}}]
["ŁAŃCUCH GOLDENWHEEL","CHAIN,Z9-116 LINKS","CHAIN 9-SPEED GOLDENWHEEL","LANC000003",12.48,17.471999999999998,{"$f":"SEARCH(MASTER_EN!$AA$13,C:C)","v":{"$error":"#VALUE!"}}]
["ŁAŃCUCH 9-BIEGÓW SHIMANO","CH-HG53 9-BIEGÓW 116 LINKS","CHAIN 9-SPEED SHIMANO","LANC000001",15.8,22.1,{"$f":"SEARCH(MASTER_EN!$AA$13,C:C)","v":{"$error":"#VALUE!"}}]
["OSŁONA ŁAŃCUCHA ","OSŁONA BZEN00005_2021_REV B","CHAIN COVER","OSLA000002",15,21,{"$f":"SEARCH(MASTER_EN!$AA$13,C:C)","v":{"$error":"#VALUE!"}}]
["WTYCZKA DO ŁADOWARKI 2PIN","LP-12-C02PE-02-001","CHARGER PLUG 2PIN","WTYC000002",4.3680000000000003,6.1151999999999997,{"$f":"SEARCH(MASTER_EN!$AA$13,C:C)","v":{"$error":"#VALUE!"}}]
["WTYCZKA DO ŁADOWARKI 3PIN","CHARGER PLUG WEIPU SF12 SERIES 3 P","CHARGER PLUG 3PIN","WTYC000001",19.623599999999996,27.473039999999994,{"$f":"SEARCH(MASTER_EN!$AA$13,C:C)","v":{"$error":"#VALUE!"}}]
["ŁADOWARKA GOTOWA 2021","ŁADOWARKA GOTOWA 2021","CHARGER PREPARED 2021","LADG000003",40,56,{"$f":"SEARCH(MASTER_EN!$AA$13,C:C)","v":{"$error":"#VALUE!"}}]
["ŁADOWARKA GOTOWA 2022","ŁADOWARKA GOTOWA 2022","CHARGER PREPARED 2022","LADG000001",40,56,{"$f":"SEARCH(MASTER_EN!$AA$13,C:C)","v":{"$error":"#VALUE!"}}]
["GNIAZDO ŁADOWANIA 2PIN 2022","CHARGING SOCKET LP-12-J02SX-02-101","CHARGING SOCKET 2PIN 2022","GNIA000002",2.9,4,{"$f":"SEARCH(MASTER_EN!$AA$13,C:C)","v":{"$error":"#VALUE!"}}]
["GNIAZDO ŁADOWANIA 3PIN 2021","CHARGING SOCKET WEIPU SF12 SERIES 3 P","CHARGING SOCKET 3PIN 2021","GNIA000001",9.8000000000000007,13.7,{"$f":"SEARCH(MASTER_EN!$AA$13,C:C)","v":{"$error":"#VALUE!"}}]
["GNIAZDO ŁADOWANIA GOTOWE 2022","CHARGING SOCKET PREPARED 2022","CHARGING SOCKET PREPARED 2022","GLAD000001",20,28,{"$f":"SEARCH(MASTER_EN!$AA$13,C:C)","v":{"$error":"#VALUE!"}}]
["KONEKTOR XT30-F ŻEŃSKIE","WTYK ZASILAJĄCE DC XT30-F ŻEŃSKIE PIN2 NA PRZEWÓD","CONNECTOR XT30-F FEMALE","KONE000007",0.60720000000000007,0.85008000000000006,{"$f":"SEARCH(MASTER_EN!$AA$13,C:C)","v":{"$error":"#VALUE!"}}]
["KONEKTOR XT30-M MĘSKIE ","WTYK ZASILAJĄCE DC XT30-M MĘSKIE PIN2 NA PRZEWÓD","CONNECTOR XT30-M MALE","KONE000008",1.03776,1.4528639999999999,{"$f":"SEARCH(MASTER_EN!$AA$13,C:C)","v":{"$error":"#VALUE!"}}]
["KONEKTOR XT60-F ŻEŃSKIE","WTYK ZASILAJĄCE DC XT60-F ŻEŃSKIE PIN2 NA PRZEWÓD","CONNECTOR XT60-F FEMALE","KONE000005",0.9,1.25,{"$f":"SEARCH(MASTER_EN!$AA$13,C:C)","v":{"$error":"#VALUE!"}}]
["KONEKTOR XT60-M MĘSKIE","WTYK ZASILAJĄCE DC XT60-M MĘSKIE PIN2 NA PRZEWÓD","CONNECTOR XT60-M MALE","KONE000006",0.9,1.25,{"$f":"SEARCH(MASTER_EN!$AA$13,C:C)","v":{"$error":"#VALUE!"}}]
["KONTROLER GOTOWY 2023","KONTROLER GOTOWY","CONTROLLER PREPARED 2023","KONG000001",70,98,{"$f":"SEARCH(MASTER_EN!$AA$13,C:C)","v":{"$error":"#VALUE!"}}]
["KORBY","CRANK SET STEPS E-ETB FC-E5010 175MM ONLY CRANKS","CRANKS","KORB000001",15,21,{"$f":"SEARCH(MASTER_EN!$AA$13,C:C)","v":{"$error":"#VALUE!"}}]
["PANCERZ LINKI PRZERZUTKI","DERAILLEUR SP CABLE 4MM","DERAILLEUR CABLE CASING","PALI000003",0.312,0.43679999999999997,{"$f":"SEARCH(MASTER_EN!$AA$13,C:C)","v":{"$error":"#VALUE!"}}]
["HAK PRZERZUTKI HAMULEC FLAT MOUNT BER","FLAT MOUNT BRAKE CALIPER, ANODIZED BLACK, FORGED PROCESS D15-A122-C","DERAILLEUR HANGER BRAKE FLAT MOUNT BER","HAKP000007",23,32.199999999999996,{"$f":"SEARCH(MASTER_EN!$AA$13,C:C)","v":{"$error":"#VALUE!"}}]
["HAK PRZERZUTKI DO GATES AMS/LON/MIL/VIE","SINGLE SPEED DERAULLER HANGERS, ANODIZED BLACK A6061_T6_FULL CNC D15-A122-E","DERAILLEUR HANGER FOR GATES AMS/LON/MIL/VIE","HAKP000005",15,21,{"$f":"SEARCH(MASTER_EN!$AA$13,C:C)","v":{"$error":"#VALUE!"}}]
["HAK PRZERZUTKI DO SHIMANO AMS/BRU/LON/VIE","SHIMANO DERAILLEUR HANGERS, ANODIZED BLACK A6061_T6_FULL CNC D15-A122-B","DERAILLEUR HANGER FOR SHIMANO AMS/BRU/LON/VIE","HAKP000004",20,28,{"$f":"SEARCH(MASTER_EN!$AA$13,C:C)","v":{"$error":"#VALUE!"}}]
["HAK PRZERZUTKI HAMULEC POST MOUNT AMS/BRU/LON/MIL/VIE","POST MOUNT BRAKE CALIPER, ANODIZED BLACK, FORGED PROCESS D15-A122-D","DERAILLEUR HANGER POST MOUNT AMS/BRU/LON/MIL/VIE","HAKP000006",20,28,{"$f":"SEARCH(MASTER_EN!$AA$13,C:C)","v":{"$error":"#VALUE!"}}]
["DŹWIGNIA PRZERZUTKI ALIVIO","SHIFT LEVER RIGHT 9S W/OGD SL­M3100­R ALIVIO","DERAILLEUR LEVER ALIVIO","DZWP000002",17.7,24.8,{"$f":"SEARCH(MASTER_EN!$AA$13,C:C)","v":{"$error":"#VALUE!"}}]
["TARCZA HAMULCOWA 160MM","TARCZA HAMULCA 160MM 6 SR SM-RT56 DO OKŁ ZYW","DISK ROTOR 160MM","TARH000001",3.2759999999999998,4.5863999999999994,{"$f":"SEARCH(MASTER_EN!$AA$13,C:C)","v":{"$error":"#VALUE!"}}]
["WYŚWIETLACZ 2021","DISPLAY DP E08.CAN 500MM M5.4","DISPLAY 2020","WYSW000002",25,35,{"$f":"SEARCH(MASTER_EN!$AA$13,C:C)","v":{"$error":"#VALUE!"}}]
["WYŚWIETLACZ 2022/2023","DISPLAY DP  E160.CAN","DISPLAY 2022/2022","WYSW000003",45,62.999999999999993,{"$f":"SEARCH(MASTER_EN!$AA$13,C:C)","v":{"$error":"#VALUE!"}}]
["PRZEWÓD PRZEDŁUŻAJĄCY WYŚWIETLACZA 1200MM","1T1 CABLE FROM CONTROLLER TO DISPLAY,1200MM G8.4/G5.2","DISPLAY EXTENSION CABLE 1200MM","PRZE000009",11.746560000000001,16.445184000000001,{"$f":"SEARCH(MASTER_EN!$AA$13,C:C)","v":{"$error":"#VALUE!"}}]
["PRZEWÓD PRZEDŁUŻAJĄCY WYŚWIETLACZA 300MM","PRZEWÓD PRZEDŁUŻAJĄCY DO WYŚWIETLACZA 300G/M5.4","DISPLAY EXTENSION CABLE 300MM","PRZE000011",2.1840000000000002,3.0575999999999999,{"$f":"SEARCH(MASTER_EN!$AA$13,C:C)","v":{"$error":"#VALUE!"}}]
["PRZEWÓD PRZEDŁUŻAJĄCY WYŚWIETLACZA 700MM","CABLE FROM CONTROLLER TO DISPLAY, 700MM M8.5.3/M5.4 EB 1T1 J","DISPLAY EXTENSION CABLE 700MM","PRZE000006",8.384879999999999,11.738831999999999,{"$f":"SEARCH(MASTER_EN!$AA$13,C:C)","v":{"$error":"#VALUE!"}}]
["BŁOTNIKI ZESTAW","FRONT EVO AL M 45X680MM, R370, WITH HOLES ANS HANGER, BLACK, DRAWING 6699 96766\r\nREAR EVO AL M 45X1100MM, R370, WITH HOLES, BLACK,DRAWING 6699 96767/ 6699 96766","FENDERS SET","BLKO000001",26.9,37.65,{"$f":"SEARCH(MASTER_EN!$AA$13,C:C)","v":{"$error":"#VALUE!"}}]
["PRZEDŁUŻKA WIDELCA","FORK STEM EXTENSION STEEL, BLACK, W/O LOGO","FORK STEM EXTENSION","PRWI000001",14.4,20.149999999999999,{"$f":"SEARCH(MASTER_EN!$AA$13,C:C)","v":{"$error":"#VALUE!"}}]
["PRZEDNIA TARCZA PASEK GOTOWA 46T AMS/VIE","PRZEDNIA TARCZA PASEK GOTOWA 46T AMS","FRONT CHAINRING BELT PREPARED 46T AMS/VIE","PTPG000001",124.00680000000001,173.60952,{"$f":"SEARCH(MASTER_EN!$AA$13,C:C)","v":{"$error":"#VALUE!"}}]
["PRZEDNIA TARCZA PASEK GOTOWA 55T MIL/LON","PRZEDNIA TARCZA PASEK GOTOWA 55T MIL/LON","FRONT CHAINRING BELT PREPARED 55T MIL/LON","PTPG000003",134.63831999999999,188.49364799999998,{"$f":"SEARCH(MASTER_EN!$AA$13,C:C)","v":{"$error":"#VALUE!"}}]
["PRZEDNIA TARCZA ŁAŃCUCH GOTOWA ","PRZEDNIA TARCZA ŁAŃCUCH GOTOWA","FRONT CHAINRING CHAIN PREPARED","PTLG000001",45.2,63.3,{"$f":"SEARCH(MASTER_EN!$AA$13,C:C)","v":{"$error":"#VALUE!"}}]
["LAMPKA PRZEDNIA HERRMANS","FRONT LIGHT H-BLACK PRO E 6-12V S/S ED BLACK BRACKET SUSPENSION FORK E1A","FRONT LAMP HERRMANS","LAMP000002",50,70.2,{"$f":"SEARCH(MASTER_EN!$AA$13,C:C)","v":{"$error":"#VALUE!"}}]
["LAMPKA PRZEDNIA GOTOWA B&M","LAMPKA PRZEDNIA GOTOWA BUSCH+MÜLLER","FRONT LAMP PREPARED B&M","LMPG000001",77,107.8,{"$f":"SEARCH(MASTER_EN!$AA$13,C:C)","v":{"$error":"#VALUE!"}}]
["HAMULEC PRZEDNI MTB 1000MM","DISC BRAKE KIT 1000MM BLACK RESIN W/O FIN","FRONT MTB BRAKE 1000MM","HAMP000003",55,77,{"$f":"SEARCH(MASTER_EN!$AA$13,C:C)","v":{"$error":"#VALUE!"}}]
["ZĘBATKA PRZEDNIA PASEK 46T","FRONT CHAINWHEEL CARBON DRIVE 46T","FRONT SPROCKET BELT 46T","ZEBA000005",94.458240000000004,132.241536,{"$f":"SEARCH(MASTER_EN!$AA$13,C:C)","v":{"$error":"#VALUE!"}}]
["ZĘBATKA PRZEDNIA PASEK 50T","FRONT CHAINWHEEL CARBON DRIVE 50T","FRONT SPROCKET BELT 50T","ZEBA000008",108.7992,152.31887999999998,{"$f":"SEARCH(MASTER_EN!$AA$13,C:C)","v":{"$error":"#VALUE!"}}]
["ZĘBATKA PRZEDNIA ŁAŃCUCH 44T","FRONT CHAINWHEEL BCD104MM,44T, SINGLE SPEED BLACK","FRONT SPROCKET CHAIN 44T","ZEBA000009",8.7823200000000003,12.295247999999999,{"$f":"SEARCH(MASTER_EN!$AA$13,C:C)","v":{"$error":"#VALUE!"}}]
["KOŁO PRZEDNIE GOTOWE QR SZYBKOZAMYKACZ AMS/ BRU","KOŁO PRZEDNIE GOTOWE QR SZYBKOZAMYKACZ AMS/ BRU","FRONT WHEEL PREPARED QR QUICK RELEASE AMS/ BRU","KOPG000003",35.631599999999999,49.884239999999998,{"$f":"SEARCH(MASTER_EN!$AA$13,C:C)","v":{"$error":"#VALUE!"}}]
["KOŁO PRZEDNIE GOTOWE TA SZTYWNA OŚ LON","KOŁO PRZEDNIE GOTOWE TA SZTYWNA OŚ LON","FRONT WHEEL PREPARED TA THRU AXLE LON","KOPG000001",90.20232,126.28324799999999,{"$f":"SEARCH(MASTER_EN!$AA$13,C:C)","v":{"$error":"#VALUE!"}}]
["KOŁO PRZEDNIE GOTOWE TA SZTYWNA OŚ MIL","KOŁO PRZEDNIE GOTOWE TA SZTYWNA OŚ MIL","FRONT WHEEL PREPARED TA THRU AXLE MIL","KOPG000002",85.096320000000006,119.13484800000001,{"$f":"SEARCH(MASTER_EN!$AA$13,C:C)","v":{"$error":"#VALUE!"}}]
["KOŁO PRZEDNIE QUICK RELEASE","FRONT WHEEL J19DB FRONT QR BLACK W/O LOGO 28 HOLES QUICK RELEASE OLD 100MM BLACK W/O LOGO","FRONT WHEEL QUICK RELEASE","KOLP000006",43,60.199999999999996,{"$f":"SEARCH(MASTER_EN!$AA$13,C:C)","v":{"$error":"#VALUE!"}}]
["KOŁO PRZEDNIE THRU AXLE","FRONT WHEEL J19DB FRONT TA BLACK W/O LOGO 28 HOLES THRU AXLE 12MM OLD 100MM BLACK W/O LOGO","FRONT WHEEL THRU AXLE","KOLP000007",49,68.599999999999994,{"$f":"SEARCH(MASTER_EN!$AA$13,C:C)","v":{"$error":"#VALUE!"}}]
["BEZPIECZNIK 15A","15A; 32V; 11MM - OP. 100SZT","FUSE 15A","BEZP000002",0.5,0.7,{"$f":"SEARCH(MASTER_EN!$AA$13,C:C)","v":{"$error":"#VALUE!"}}]
["BEZPIECZNIK 5A","5A; 32V; 11MM - OP. 100SZT","FUSE 5A","BEZP000001",0.5,0.7,{"$f":"SEARCH(MASTER_EN!$AA$13,C:C)","v":{"$error":"#VALUE!"}}]
["CHWYTY CZARNE DŁUGIE AMS/BRU/LON/VIEN","GRIP KS-G601 GRIP Ø22X135MM/135 BLACK ECO LEATHER, WITHOUT PLUG","GRIPS BLACK LONG AMS/BRU/LON/VIEN","CHWY000006",11,15.399999999999999,{"$f":"SEARCH(MASTER_EN!$AA$13,C:C)","v":{"$error":"#VALUE!"}}]
["CHWYTY CZARNE KRÓTKIE AMS","BLACK ECO LEATHER,W/BLACK STITCHING, SIZE:₵22X125/125WITHOUT PLUG","GRIPS BLACK SHORT AMS","CHWY000009",11,15.399999999999999,{"$f":"SEARCH(MASTER_EN!$AA$13,C:C)","v":{"$error":"#VALUE!"}}]
["CHWYTY BRĄZOWE DŁUGIE AMS/BRU2022/LON","GRIP KS-G601 GRIP Ø22X135MM/135 BROWN ECO LEATHER, WITHOUT PLUG","GRIPS BROWN LONG AMS/BRU2022/LON","CHWY000007",11,15.399999999999999,{"$f":"SEARCH(MASTER_EN!$AA$13,C:C)","v":{"$error":"#VALUE!"}}]
["CHWYTY BRĄZOWE KRÓTKIE AMS","BROWN ECO LEATHER,W/BLACK STITCHING, SIZE:₵22X125/125WITHOUT PLUG","GRIPS BROWN SHORT AMS","CHWY000010",11,15.399999999999999,{"$f":"SEARCH(MASTER_EN!$AA$13,C:C)","v":{"$error":"#VALUE!"}}]
["CHWYTY MIL2023","GRIP LUNA LOCK DD40BX 130MM BLACK-BLACK Ø22MM W. LOCKRING BLACK","GRIPS MIL2023","CHWY000008",9,12.6,{"$f":"SEARCH(MASTER_EN!$AA$13,C:C)","v":{"$error":"#VALUE!"}}]
["KIEROWNICA AMS","KIEROWNICA AMS","HANDLEBAR AMS","KIER000001",18.5,25.9,{"$f":"SEARCH(MASTER_EN!$AA$13,C:C)","v":{"$error":"#VALUE!"}}]
["KIEROWNICA BER","KIEROWNICA BER","HANDLEBAR BER","KIER000008",20.100000000000001,28.15,{"$f":"SEARCH(MASTER_EN!$AA$13,C:C)","v":{"$error":"#VALUE!"}}]
["KIEROWNICA BRU/LON/VIE","KIEROWNICA BRU/LON/VIE","HANDLEBAR BRU/LON/VIE","KIER000004",24.5,34.299999999999997,{"$f":"SEARCH(MASTER_EN!$AA$13,C:C)","v":{"$error":"#VALUE!"}}]
["KIEROWNICA MIL","KIEROWNICA MIL","HANDLEBAR MIL","KIER000007",24.5,34.299999999999997,{"$f":"SEARCH(MASTER_EN!$AA$13,C:C)","v":{"$error":"#VALUE!"}}]
["ŁOŻYSKA STERÓW AMS","HEADSET HSC.BK SEMI INTEGRATED FOR 1 1/8\" STEERER UPPER AND LOWER CUP OD44MM WITH STAR NUT FOR ALLOY STEERER BLACK W/O LOGO","HEADSET AMS","LOZS000001",7.9497600000000004,11.129664,{"$f":"SEARCH(MASTER_EN!$AA$13,C:C)","v":{"$error":"#VALUE!"}}]
["ŁOŻYSKA STERÓW BRU","HEADSET HS3.BK SEMI INTEGRATED HEADSET FOR 1 1/8\" - 1 1/2\" STEERER UPPER CUP OD44MM, LOWER CUP OD 56MM WITH WEDGE FOR CARBON STEERER BLACK COLOR W/O LOGO","HEADSET BRU","LOZS000002",15.877679999999998,22.228751999999997,{"$f":"SEARCH(MASTER_EN!$AA$13,C:C)","v":{"$error":"#VALUE!"}}]
["ŁOŻYSKA STERÓW VIE","SEMI INTEGRATED HEADSET, FOR 1 1/8\"\"‐1 1/2\"\"\nSTEERER, 25.4MM TOP COVER,UPPER CUP OD\n44MM,\nLOWER CUP OD 56MM. BLACK COLOR. W/O LOGO","HEADSET VIE","LOZS000005",15.356639999999999,21.499295999999998,{"$f":"SEARCH(MASTER_EN!$AA$13,C:C)","v":{"$error":"#VALUE!"}}]
["EMBLEMAT NA STERÓWKĘ LOGO","HEADBADGE EMBOSSEB LOGO B DIAM. 50MM ALUMINIUM MATT/BRONZE","HEADTUBE LOGO BADGE","EMBL000001",4.2,5.9,{"$f":"SEARCH(MASTER_EN!$AA$13,C:C)","v":{"$error":"#VALUE!"}}]
["DĘTKA CONTINENTAL","CONTINENTAL TOUR 28 ALL 32/47-609/642 SCLAVERAND PRESTA 42MM UNITUBE","INNER TUBE CONTINENTAL","DETK000001",6,8.3999999999999986,{"$f":"SEARCH(MASTER_EN!$AA$13,C:C)","v":{"$error":"#VALUE!"}}]
["DĘTKA MITAS","37/54-622/635,FV47 28/29-1,50-2,10","INNER TUBE MITAS","DETK000002",2.7,3.8,{"$f":"SEARCH(MASTER_EN!$AA$13,C:C)","v":{"$error":"#VALUE!"}}]
["PODPÓRKA ","MOOVE KICKSTAND 250MM BLACK RF:282","KICKSTAND","PODP000001",4.5,6.3,{"$f":"SEARCH(MASTER_EN!$AA$13,C:C)","v":{"$error":"#VALUE!"}}]
["DOLNA MISKA ŁOŻYSKA MASZYNOWEGO LON/MIL","DOLNA MISKA ŁOŻYSKA 56 CUP LIDS","LOWER CUP MACHINE BEARING LON/MIL","LOZS000004",1.4039999999999999,1.9655999999999998,{"$f":"SEARCH(MASTER_EN!$AA$13,C:C)","v":{"$error":"#VALUE!"}}]
["ŁOŻYSKO MASZYNOWE DO WIDELCA CARBON LON/MIL","LOWER BEARING FOR CARBON FORK TCK085D, SEALED, 40*51.8*8MM(36℃*45℃)","LOWER MACHINE BEARING FOR CARBON FORK LON/MIL","LOZS000003",5.6783999999999999,7.9497599999999995,{"$f":"SEARCH(MASTER_EN!$AA$13,C:C)","v":{"$error":"#VALUE!"}}]
["DOLNA BIEŻNIA ŁOŻYSKA MASZYNOWEGO VIE","DOLNA BIEŻNIA ŁOŻYSKA IB:871491 OB:8714910000","LOWER RACEWAY FOR MACHINE BEARING VIE","LOZS000006",2.4232800000000001,3.3925920000000001,{"$f":"SEARCH(MASTER_EN!$AA$13,C:C)","v":{"$error":"#VALUE!"}}]
["OLIWKA I WKŁAD DO PRZEWODÓW HAMULCOWYCH","OLIWKA I WKŁAD DO PRZEWODÓW SM-BH60","OLIVE AND INSERT FOR BRAKE CABLE","ZESH000001",0.87768000000000002,1.2287519999999998,{"$f":"SEARCH(MASTER_EN!$AA$13,C:C)","v":{"$error":"#VALUE!"}}]
["KOŃCÓWKA PANCERZA ","KOŃCÓWKA PANCERZA PRZERZUTKI","OUTER END DERAILLEUR","KONP000001",0.2,0.3,{"$f":"SEARCH(MASTER_EN!$AA$13,C:C)","v":{"$error":"#VALUE!"}}]
["WIDELEC MALOWANY 22 AMS 1014 BEŻOWY IVORY","WIDELEC MALOWANY 22 AMS 1014 BEŻOWY IVORY","PAINTED FORK 22 AMS 1014 BEIGE IVORY","WIDMA22AMS1014BZ",75,105,{"$f":"SEARCH(MASTER_EN!$AA$13,C:C)","v":{"$error":"#VALUE!"}}]
["WIDELEC MALOWANY 22 AMS 3020 CZERWONY TRAFFIC RED","WIDELEC MALOWANY 22 AMS 3020 CZERWONY TRAFFIC RED","PAINTED FORK 22 AMS 3020 TRAFFIC RED","WIDMA22AMS3020CZE",75,105,{"$f":"SEARCH(MASTER_EN!$AA$13,C:C)","v":{"$error":"#VALUE!"}}]
["WIDELEC MALOWANY 22 AMS 6007 ZIELONY BOTTLE GREEN","WIDELEC MALOWANY 22 AMS 6007 ZIELONY BOTTLE GREEN","PAINTED FORK 22 AMS 6007 BOTTLE GREEN","WIDMA22AMS6007ZI",75,105,{"$f":"SEARCH(MASTER_EN!$AA$13,C:C)","v":{"$error":"#VALUE!"}}]
["WIDELEC MALOWANY 22 AMS 9003 BIAŁY SIGNAL WHITE","WIDELEC MALOWANY 22 AMS 9003 BIAŁY SIGNAL WHITE","PAINTED FORK 22 AMS 9003 SIGNAL WHITE","WIDMA22AMS9003BI",75,105,{"$f":"SEARCH(MASTER_EN!$AA$13,C:C)","v":{"$error":"#VALUE!"}}]
["WIDELEC MALOWANY 22 AMS 9005 CZARNY JET BLACK","WIDELEC MALOWANY 22 AMS 9005 CZARNY JET BLACK","PAINTED FORK 22 AMS 9005 JET BLACK","WIDMA22AMS9005CZ",75,105,{"$f":"SEARCH(MASTER_EN!$AA$13,C:C)","v":{"$error":"#VALUE!"}}]
["WIDELEC MALOWANY 22 AMS NIEBIESKI KAMELEON","WIDELEC MALOWANY 22 AMS NIEBIESKI KAMELEON","PAINTED FORK 22 AMS BLUE CHAMELEON","WIDMA22AMSNK",75,105,{"$f":"SEARCH(MASTER_EN!$AA$13,C:C)","v":{"$error":"#VALUE!"}}]
["WIDELEC MALOWANY 22 AMS PE10B MIEDZIANY COPPER","WIDELEC MALOWANY 22 AMS PE10B MIEDZIANY COPPER","PAINTED FORK 22 AMS PE10B COPPER COPPER","WIDMA22AMSPE10BMI",75,105,{"$f":"SEARCH(MASTER_EN!$AA$13,C:C)","v":{"$error":"#VALUE!"}}]
["WIDELEC MALOWANY 22 BRU 1014 BEŻOWY IVORY","WIDELEC MALOWANY 22 BRU 1014 BEŻOWY IVORY","PAINTED FORK 22 BRU 1014 BEIGE IVORY","WIDMA22BRU1014BZ",100,140,{"$f":"SEARCH(MASTER_EN!$AA$13,C:C)","v":{"$error":"#VALUE!"}}]
["WIDELEC MALOWANY 22 BRU 5021 NIEBIESKI WATER BLUE","WIDELEC MALOWANY 22 BRU 5021 NIEBIESKI WATER BLUE","PAINTED FORK 22 BRU 5021 WATER BLUE","WIDMA22BRU5021NI",100,140,{"$f":"SEARCH(MASTER_EN!$AA$13,C:C)","v":{"$error":"#VALUE!"}}]
["WIDELEC MALOWANY 22 BRU 6007 ZIELONY BOTTLE GREEN","WIDELEC MALOWANY 22 BRU 6007 ZIELONY BOTTLE GREEN","PAINTED FORK 22 BRU 6007 GREEN BOTTLE GREEN","WIDMA22BRU6007ZI",100,140,{"$f":"SEARCH(MASTER_EN!$AA$13,C:C)","v":{"$error":"#VALUE!"}}]
["WIDELEC MALOWANY 22 BRU 9005 CZARNY JET BLACK","WIDELEC MALOWANY 22 BRU 9005 CZARNY JET BLACK","PAINTED FORK 22 BRU 9005 JET BLACK","WIDMA22BRU9005CZ",100,140,{"$f":"SEARCH(MASTER_EN!$AA$13,C:C)","v":{"$error":"#VALUE!"}}]
["WIDELEC MALOWANY 22 BRU PE10B MIEDZIANY COPPER","WIDELEC MALOWANY 22 BRU PE10B MIEDZIANY COPPER","PAINTED FORK 22 BRU PE10B COPPER COPPER","WIDMA22BRUPE10BMI",100,140,{"$f":"SEARCH(MASTER_EN!$AA$13,C:C)","v":{"$error":"#VALUE!"}}]
["WIDELEC MALOWANY 22 BRU 9003 BIAŁY SIGNAL WHITE","WIDELEC MALOWANY 22 BRU 9003 BIAŁY SIGNAL WHITE","PAINTED FORK 23 BRU 9003 SIGNAL WHITE","WIDMA22BRU9003BI",100,140,{"$f":"SEARCH(MASTER_EN!$AA$13,C:C)","v":{"$error":"#VALUE!"}}]
["PEDAŁY ","CNC ALUMINIUM Z TAŚMĄ KLEJĄCĄ CR-MO USZCZELNIONE ŁOŻYSKO+DU 115,5 * 85* 22MM","PEDALS","PEDA000003",18,25.2,{"$f":"SEARCH(MASTER_EN!$AA$13,C:C)","v":{"$error":"#VALUE!"}}]
["ADAPTER PRZEDNIEJ ZĘBATKI 4 x 100MM","SR PA01.32.ST1601 4 ARMS(4 X 100MM)","REAR BRAKE ADAPTER 4 x 100MM","ADZE000001",17,23.799999999999997,{"$f":"SEARCH(MASTER_EN!$AA$13,C:C)","v":{"$error":"#VALUE!"}}]
["BAGAŻNIK ","TOUR PRO 28\" AVS H359, W/O EXT, MATT BLACK, H-CARGO","REAR CARRIER","BAGA000001",25,35,{"$f":"SEARCH(MASTER_EN!$AA$13,C:C)","v":{"$error":"#VALUE!"}}]
["PRĘTY MOCUJĄCE DO BAGAŻNIKA AMS/BRU/LON","ADJUSTABLE EXTENDER SET 8X230MM WITH FIXATION PARTS MA","REAR CARRIER MOUNTING RODS AMS/BRU/LON","MOCO000001",1.8479999999999999,2.5871999999999997,{"$f":"SEARCH(MASTER_EN!$AA$13,C:C)","v":{"$error":"#VALUE!"}}]
["PRĘTY MOCUJĄCE DO BAGAŻNIKA VIE","ADJUSTABLE EXTENDER SET 8X260MM WITH FIXATION PARTS MA","REAR CARRIER MOUNTING RODS VIE","MOCO000007",2.496,3.4943999999999997,{"$f":"SEARCH(MASTER_EN!$AA$13,C:C)","v":{"$error":"#VALUE!"}}]
["BAGAŻNIK GOTOWY ","BAGAŻNIK GOTOWY","REAR CARRIER PREPARED","BAGG000001",50,70,{"$f":"SEARCH(MASTER_EN!$AA$13,C:C)","v":{"$error":"#VALUE!"}}]
["PRZERZUTKA TYLNA 9RZĘDÓW ALIVIO","REAR DERAILLEUR 9-SPEED SGS TYPE TOP NORMAL BLACK","REAR DERAILLEUR 9-SPEED ALIVIO","PRZT000001",36,50.4,{"$f":"SEARCH(MASTER_EN!$AA$13,C:C)","v":{"$error":"#VALUE!"}}]
["LAMPKA TYLNA HERRMANS","PSET REAR LIGHT H-CARGO E-BIKE NARROW BLACK W BR-12 REFLECTOR K, TP-RBI","REAR LIGHT HERRMANS","LAMT000001",15,21,{"$f":"SEARCH(MASTER_EN!$AA$13,C:C)","v":{"$error":"#VALUE!"}}]
["HAMULEC TYLNY MTB 1700MM ","DISC BRAKE KIT 1700MM BLACK RESIN W/O FIN","REAR MTB BRAKE 1700MM","HAMT000002",55,77,{"$f":"SEARCH(MASTER_EN!$AA$13,C:C)","v":{"$error":"#VALUE!"}}]
["ZĘBATKA TYLNA PASEK 19T","REAR CHAINWHEEL CARBON DRIVE CDX19T","REAR SPROCKET BELT 19T","ZEBA000004",100.23216000000001,140.32502400000001,{"$f":"SEARCH(MASTER_EN!$AA$13,C:C)","v":{"$error":"#VALUE!"}}]
["KOŁO TYLNE ","REAR WHEEL J19DB REAR BLACK W/O LOGO 36 HOLES BAFANG RM G120","REAR WHEEL","KOLT000005",223,312.2,{"$f":"SEARCH(MASTER_EN!$AA$13,C:C)","v":{"$error":"#VALUE!"}}]
["KOŁO TYLNE GOTOWE PASEK","KOŁO TYLNE GOTOWE  KOŁO TYLNE PASEK","REAR WHEEL PREPARED BELT","KOTG000002",348.9468,488.52551999999997,{"$f":"SEARCH(MASTER_EN!$AA$13,C:C)","v":{"$error":"#VALUE!"}}]
["KOŁO TYLNE GOTOWE ŁAŃCUCH","KOŁO TYLNE GOTOWE  KOŁO TYLNE ŁAŃCUCH","REAR WHEEL PREPARED CHAIN","KOTG000001",277.21440000000001,388.10016000000002,{"$f":"SEARCH(MASTER_EN!$AA$13,C:C)","v":{"$error":"#VALUE!"}}]
["KOŁO TYLNE GOTOWE PASEK MIL","KOŁO TYLNE GOTOWE  KOŁO TYLNE PASEK MIL","REAR WHEEL PREPARED MIL","KOTG000003",146.32415999999998,204.85382399999995,{"$f":"SEARCH(MASTER_EN!$AA$13,C:C)","v":{"$error":"#VALUE!"}}]
["FARTUCH CONTINENTAL","RED 700X18 F/V","RIM TAPE CONTINENTAL","FART000001",2,2.8,{"$f":"SEARCH(MASTER_EN!$AA$13,C:C)","v":{"$error":"#VALUE!"}}]
["SIODŁO CZARNE AMS/BRU/LON","DS2453.BK STEEL RAIL, WITH COIL SPRING, SIZE: 285X150MM, BLACK","SADDLE BLACK AMS/BRU/LON","SIOD000004",15,21,{"$f":"SEARCH(MASTER_EN!$AA$13,C:C)","v":{"$error":"#VALUE!"}}]
["SIODŁO BRĄZOWE AMS/BRU/LON","DS2453.BR STEEL RAIL, WITH COIL SPRING, SIZE: 285X150MM, BROWN","SADDLE BROWN AMS/BRU/LON","SIOD000005",8.5500000000000007,11.97,{"$f":"SEARCH(MASTER_EN!$AA$13,C:C)","v":{"$error":"#VALUE!"}}]
["SIODŁO MIL/BER","VL-3352 SINGLE DESTINY BASE, GEL PADDING FIL STEEL RAIL, SIZE: 287X144MM BLACK","SADDLE MIL/BER","SIOD000001",7.9,11.05,{"$f":"SEARCH(MASTER_EN!$AA$13,C:C)","v":{"$error":"#VALUE!"}}]
["SIODŁO GOTOWE CZARNE DŁUGI WSPORNIK AMS/BRU/LON","SIODŁO GOTOWE CZARNE DŁUGI WSPORNIK AMS/BRU/LON","SADDLE PREPARED BLACK LONG SEATPOST AMS/BRU/LON","SIOG000001",31.149360000000001,43.609104000000002,{"$f":"SEARCH(MASTER_EN!$AA$13,C:C)","v":{"$error":"#VALUE!"}}]
["SIODŁO GOTOWE CZARNE DŁUGI WSPORNIK VIE","SIODŁO GOTOWE CZARNE DŁUGI WSPORNIK VIE","SADDLE PREPARED BLACK LONG SEATPOST VIE","SIOG000006",31.149360000000001,43.609104000000002,{"$f":"SEARCH(MASTER_EN!$AA$13,C:C)","v":{"$error":"#VALUE!"}}]
["SIODŁO GOTOWE CZARNE KRÓTKI WSPORNIK AMS/BRU/LON","SIODŁO GOTOWE CZARNE KRÓTKI WSPORNIK AMS/BRU/LON","SADDLE PREPARED BLACK SHORT SEATPOST AMS/BRU/LON","SIOG000002",20.010000000000002,28.013999999999999,{"$f":"SEARCH(MASTER_EN!$AA$13,C:C)","v":{"$error":"#VALUE!"}}]
["SIODŁO GOTOWE BRĄZOWE DŁUGI WSPORNIK AMS/BRU/LON","SIODŁO GOTOWE BRĄZOWE DŁUGI WSPORNIK AMS/BRU/LON","SADDLE PREPARED BROWN LONG SEATPOST AMS/BRU/LON","SIOG000003",31.497120000000002,44.095967999999999,{"$f":"SEARCH(MASTER_EN!$AA$13,C:C)","v":{"$error":"#VALUE!"}}]
["SIODŁO GOTOWE BRĄZOWE KRÓTKI WSPORNIK AMS/BRU/LON","SIODŁO GOTOWE BRĄZOWE KRÓTKI WSPORNIK AMS/BRU/LON","SADDLE PREPARED BROWN SHORT SEATPOST AMS/BRU/LON","SIOG000004",20.357759999999999,28.500863999999996,{"$f":"SEARCH(MASTER_EN!$AA$13,C:C)","v":{"$error":"#VALUE!"}}]
["SIODŁO GOTOWE MIL","SIODŁO GOTOWE MIL","SADDLE PREPARED MIL","SIOG000005",64,89.6,{"$f":"SEARCH(MASTER_EN!$AA$13,C:C)","v":{"$error":"#VALUE!"}}]
["ZACISK SIODŁA ","SEAT CLAMP AT-115.BK ALLOY SEAT CLAMP DIA.35.0. SAND BLASTED BLACK W/O LOGO","SEAT CLAMP","ZACS000001",3.1,4.3499999999999996,{"$f":"SEARCH(MASTER_EN!$AA$13,C:C)","v":{"$error":"#VALUE!"}}]
["EMBLEMAT NA PODSIODŁÓWKĘ LOGO","SEATLOGO EMBOSSED BZEN 68X20MM ALUMINIUM MATT/BROZNE/DARK","SEATPOST LOGO BADGE","EMBL000002",4.5,6.3,{"$f":"SEARCH(MASTER_EN!$AA$13,C:C)","v":{"$error":"#VALUE!"}}]
["WSPORNIK SIODŁA DŁUGI","Ø31.6 H2019 07/01 DS ISO-M BLACK","SEATPOST LONG","WSSI000001",20.5,28.7,{"$f":"SEARCH(MASTER_EN!$AA$13,C:C)","v":{"$error":"#VALUE!"}}]
["WSPORNIK SIODŁA KRÓTKI 300MM","SZTYCA ZOOM SP-214 31,6/300 CZARNY MAT","SEATPOST SHORT 300MM","WSSI000003",18.8,26.32,{"$f":"SEARCH(MASTER_EN!$AA$13,C:C)","v":{"$error":"#VALUE!"}}]
["WSPORNIK SIODŁA ZE ŚWIATŁAMI","Ø31.6 H2018 S311E ISO-4210 ROHS LIGHS SKIN K1595 BLACK S296002","SEATPOST WITH LIGHTS","WSSI000002",56,78.399999999999991,{"$f":"SEARCH(MASTER_EN!$AA$13,C:C)","v":{"$error":"#VALUE!"}}]
["TULEJA DYSTANSOWA PASEK 10.3 MM","PLASTIKOWA TULEJA DYSTANSOWA 10.3 MM","SPACER BELT 10.3 mm","TUDY000005",0.87360000000000004,1.2230399999999999,{"$f":"SEARCH(MASTER_EN!$AA$13,C:C)","v":{"$error":"#VALUE!"}}]
["TULEJA DYSTANSOWA PASEK 21.3 MM","PLASTIKOWA TULEJA DYSTANSOWA 21.3 MM","SPACER BELT 21.3 mm","TUDY000004",0.87360000000000004,1.2230399999999999,{"$f":"SEARCH(MASTER_EN!$AA$13,C:C)","v":{"$error":"#VALUE!"}}]
["TULEJA DYSTANSOWA DO BŁOTNIKA TYLNEGO","SPACER BUSHING POLYAMIDE BLACK 3810 / 5.2X12","SPACER REAR FENDER","TUDY000001",0.25391999999999998,0.35548799999999997,{"$f":"SEARCH(MASTER_EN!$AA$13,C:C)","v":{"$error":"#VALUE!"}}]
["PIERŚCIEŃ DYSTANSOWY SPACER 10MM","SPACER AR28.6.BK ALLOY SPACER ID 28.6 H: 10MM ANODIZED BLACK","SPACER RING 10MM","PIDY000002",0.45863999999999994,0.64209599999999989,{"$f":"SEARCH(MASTER_EN!$AA$13,C:C)","v":{"$error":"#VALUE!"}}]
["WSPORNIK KIEROWNICY AMS","STEM  TDS-D343G-8-8.BK 3D FORGER ALLOY STEM BARBORE 25.4 EXT.100 RAISE  +/-25° SANDBLASTED BLACK W/O LOGO","STEM AMS","WSKI000005",17.20992,24.093888,{"$f":"SEARCH(MASTER_EN!$AA$13,C:C)","v":{"$error":"#VALUE!"}}]
["WSPORNIK KIEROWNICY MIL/BRU 22","STEM  TDS-D403G-8/FOV/EN-M 3D FORGER ALLOY STEM BARBORE 31.8 EXT.100 RAISE  +/-7° SANDBLASTED BLACK W/O LOGO","STEM MIL/BRU 22","WSKI000001",22.45,31.45,{"$f":"SEARCH(MASTER_EN!$AA$13,C:C)","v":{"$error":"#VALUE!"}}]
["OŚ WIDELCA LON/MIL/BER","THRU AXLE FOR FORK GRAVEL AXLE 100*12 MM","THRU AXLE FOR FORK LON/MIL/BER","OSWI000002",21.84,30.575999999999997,{"$f":"SEARCH(MASTER_EN!$AA$13,C:C)","v":{"$error":"#VALUE!"}}]
["KARTON GÓRNY NA ROWER 2022","KARTON 1850X250X1160 \"5\" Z NADRUKIEM","TOP PACKING BOX 2022","KART000004",15.218639999999999,21.306095999999997,{"$f":"SEARCH(MASTER_EN!$AA$13,C:C)","v":{"$error":"#VALUE!"}}]
["OPONA CONTACT CITY MIL","CONTINENTAL - OPONA 01013520000 RX28 700X35C 28X2","TYRE CONTACT CITY MIL","SGM000050",18,25.2,{"$f":"SEARCH(MASTER_EN!$AA$13,C:C)","v":{"$error":"#VALUE!"}}]
["OPONA  RIDE CITY AMS/BRU/LON","42 - 622 28 \"| 700 X 42C (40C) | 28 X 1.60 42-622 RIDE CITY BLACK / BLACK WIRE REFLEX","TYRE RIDE CITY AMS/BRU/LON","OPON000002",19,26.599999999999998,{"$f":"SEARCH(MASTER_EN!$AA$13,C:C)","v":{"$error":"#VALUE!"}}]
["OPONA SPEEDRIDE BER","OPONA SPEEDRIDE 700X42C CZARNA REFL DRUT 490G","TYRE SPEEDRIDE BER","OPON000005",22.444319999999998,31.422047999999993,{"$f":"SEARCH(MASTER_EN!$AA$13,C:C)","v":{"$error":"#VALUE!"}}]
["KLIPS NA PRZEWODY 5x3","KLIPS NA PRZEWODY 5X3","WIRE CLIP 5x3","KLPR000002",0.42504000000000003,0.59505600000000003,{"$f":"SEARCH(MASTER_EN!$AA$13,C:C)","v":{"$error":"#VALUE!"}}]
["KLIPS NA PRZEWODY 5x3.6","KLIPS NA PRZEWODY 5X3.6","WIRE CLIP 5x3.6","KLPR000001",0.43,0.6,{"$f":"SEARCH(MASTER_EN!$AA$13,C:C)","v":{"$error":"#VALUE!"}}]
["KLIPS NA PRZEWODY 5x4","KLIPS NA PRZEWODY 5X4","WIRE CLIP 5x4","KLPR000003",0.42504000000000003,0.59505600000000003,{"$f":"SEARCH(MASTER_EN!$AA$13,C:C)","v":{"$error":"#VALUE!"}}]
[null,null,null,null,null,null,{"$f":"SEARCH(MASTER_EN!$AA$13,C:C)","v":{"$error":"#VALUE!"}}]
[null,null,null,null,null,null,{"$f":"SEARCH(MASTER_EN!$AA$13,C:C)","v":{"$error":"#VALUE!"}}]
[null,null,null,null,null,null,{"$f":"SEARCH(MASTER_EN!$AA$13,C:C)","v":{"$error":"#VALUE!"}}]
[null,null,null,null,null,null,{"$f":"SEARCH(MASTER_EN!$AA$13,C:C)","v":{"$error":"#VALUE!"}}]
[null,null,null,null,null,null,{"$f":"SEARCH(MASTER_EN!$AA$13,C:C)","v":{"$error":"#VALUE!"}}]
[null,null,null,null,null,null,{"$f":"SEARCH(MASTER_EN!$AA$13,C:C)","v":{"$error":"#VALUE!"}}]
[null,null,null,null,null,null,{"$f":"SEARCH(MASTER_EN!$AA$13,C:C)","v":{"$error":"#VALUE!"}}]
[null,null,null,null,null,null,{"$f":"SEARCH(MASTER_EN!$AA$13,C:C)","v":{"$error":"#VALUE!"}}]
[null,null,null,null,null,null,{"$f":"SEARCH(MASTER_EN!$AA$13,C:C)","v":{"$error":"#VALUE!"}}]
[null,null,null,null,null,null,{"$f":"SEARCH(MASTER_EN!$AA$13,C:C)","v":{"$error":"#VALUE!"}}]
[null,null,null,null,null,null,{"$f":"SEARCH(MASTER_EN!$AA$13,C:C)","v":{"$error":"#VALUE!"}}]
[null,null,null,null,null,null,{"$f":"SEARCH(MASTER_EN!$AA$13,C:C)","v":{"$error":"#VALUE!"}}]
[null,null,null,null,null,null,{"$f":"SEARCH(MASTER_EN!$AA$13,C:C)","v":{"$error":"#VALUE!"}}]
[null,null,null,null,null,null,{"$f":"SEARCH(MASTER_EN!$AA$13,C:C)","v":{"$error":"#VALUE!"}}]
[null,null,null,null,null,null,{"$f":"SEARCH(MASTER_EN!$AA$13,C:C)","v":{"$error":"#VALUE!"}}]
[null,null,null,null,null,null,{"$f":"SEARCH(MASTER_EN!$AA$13,C:C)","v":{"$error":"#VALUE!"}}]
[null,null,null,null,null,null,{"$f":"SEARCH(MASTER_EN!$AA$13,C:C)","v":{"$error":"#VALUE!"}}]
[null,null,null,null,null,null,{"$f":"SEARCH(MASTER_EN!$AA$13,C:C)","v":{"$error":"#VALUE!"}}]
[null,null,null,null,null,null,{"$f":"SEARCH(MASTER_EN!$AA$13,C:C)","v":{"$error":"#VALUE!"}}]
[null,null,null,null,null,null,{"$f":"SEARCH(MASTER_EN!$AA$13,C:C)","v":{"$error":"#VALUE!"}}]
[null,null,null,null,null,null,{"$f":"SEARCH(MASTER_EN!$AA$13,C:C)","v":{"$error":"#VALUE!"}}]
[null,null,null,null,null,null,{"$f":"SEARCH(MASTER_EN!$AA$13,C:C)","v":{"$error":"#VALUE!"}}]
[null,null,null,null,null,null,{"$f":"SEARCH(MASTER_EN!$AA$13,C:C)","v":{"$error":"#VALUE!"}}]
[null,null,null,null,null,null,{"$f":"SEARCH(MASTER_EN!$AA$13,C:C)","v":{"$error":"#VALUE!"}}]
[null,null,null,null,null,null,{"$f":"SEARCH(MASTER_EN!$AA$13,C:C)","v":{"$error":"#VALUE!"}}]
[null,null,null,null,null,null,{"$f":"SEARCH(MASTER_EN!$AA$13,C:C)","v":{"$error":"#VALUE!"}}]
[null,null,null,null,null,null,{"$f":"SEARCH(MASTER_EN!$AA$13,C:C)","v":{"$error":"#VALUE!"}}]
[null,null,null,null,null,null,{"$f":"SEARCH(MASTER_EN!$AA$13,C:C)","v":{"$error":"#VALUE!"}}]
[null,null,null,null,null,null,{"$f":"SEARCH(MASTER_EN!$AA$13,C:C)","v":{"$error":"#VALUE!"}}]
[null,null,null,null,null,null,{"$f":"SEARCH(MASTER_EN!$AA$13,C:C)","v":{"$error":"#VALUE!"}}]
[null,null,null,null,null,null,{"$f":"SEARCH(MASTER_EN!$AA$13,C:C)","v":{"$error":"#VALUE!"}}]
[null,null,null,null,null,null,{"$f":"SEARCH(MASTER_EN!$AA$13,C:C)","v":{"$error":"#VALUE!"}}]
[null,null,null,null,null,null,{"$f":"SEARCH(MASTER_EN!$AA$13,C:C)","v":{"$error":"#VALUE!"}}]
[null,null,null,null,null,null,{"$f":"SEARCH(MASTER_EN!$AA$13,C:C)","v":{"$error":"#VALUE!"}}]
[null,null,null,null,null,null,{"$f":"SEARCH(MASTER_EN!$AA$13,C:C)","v":{"$error":"#VALUE!"}}]
[null,null,null,null,null,null,{"$f":"SEARCH(MASTER_EN!$AA$13,C:C)","v":{"$error":"#VALUE!"}}]
[null,null,null,null,null,null,{"$f":"SEARCH(MASTER_EN!$AA$13,C:C)","v":{"$error":"#VALUE!"}}]
[null,null,null,null,null,null,{"$f":"SEARCH(MASTER_EN!$AA$13,C:C)","v":{"$error":"#VALUE!"}}]
[null,null,null,null,null,null,{"$f":"SEARCH(MASTER_EN!$AA$13,C:C)","v":{"$error":"#VALUE!"}}]
[null,null,null,null,null,null,{"$f":"SEARCH(MASTER_EN!$AA$13,C:C)","v":{"$error":"#VALUE!"}}]
[null,null,null,null,null,null,{"$f":"SEARCH(MASTER_EN!$AA$13,C:C)","v":{"$error":"#VALUE!"}}]
[null,null,null,null,null,null,{"$f":"SEARCH(MASTER_EN!$AA$13,C:C)","v":{"$error":"#VALUE!"}}]
[null,null,null,null,null,null,{"$f":"SEARCH(MASTER_EN!$AA$13,C:C)","v":{"$error":"#VALUE!"}}]
[null,null,null,null,null,null,{"$f":"SEARCH(MASTER_EN!$AA$13,C:C)","v":{"$error":"#VALUE!"}}]
[null,null,null,null,null,null,{"$f":"SEARCH(MASTER_EN!$AA$13,C:C)","v":{"$error":"#VALUE!"}}]
[null,null,null,null,null,null,{"$f":"SEARCH(MASTER_EN!$AA$13,C:C)","v":{"$error":"#VALUE!"}}]
[null,null,null,null,null,null,{"$f":"SEARCH(MASTER_EN!$AA$13,C:C)","v":{"$error":"#VALUE!"}}]
[null,null,null,null,null,null,{"$f":"SEARCH(MASTER_EN!$AA$13,C:C)","v":{"$error":"#VALUE!"}}]
[null,null,null,null,null,null,{"$f":"SEARCH(MASTER_EN!$AA$13,C:C)","v":{"$error":"#VALUE!"}}]
[null,null,null,null,null,null,{"$f":"SEARCH(MASTER_EN!$AA$13,C:C)","v":{"$error":"#VALUE!"}}]
[null,null,null,null,null,null,{"$f":"SEARCH(MASTER_EN!$AA$13,C:C)","v":{"$error":"#VALUE!"}}]
[null,null,null,null,null,null,{"$f":"SEARCH(MASTER_EN!$AA$13,C:C)","v":{"$error":"#VALUE!"}}]
[null,null,null,null,null,null,{"$f":"SEARCH(MASTER_EN!$AA$13,C:C)","v":{"$error":"#VALUE!"}}]
[null,null,null,null,null,null,{"$f":"SEARCH(MASTER_EN!$AA$13,C:C)","v":{"$error":"#VALUE!"}}]
[null,null,null,null,null,null,{"$f":"SEARCH(MASTER_EN!$AA$13,C:C)","v":{"$error":"#VALUE!"}}]
[null,null,null,null,null,null,{"$f":"SEARCH(MASTER_EN!$AA$13,C:C)","v":{"$error":"#VALUE!"}}]
[null,null,null,null,null,null,{"$f":"SEARCH(MASTER_EN!$AA$13,C:C)","v":{"$error":"#VALUE!"}}]
[null,null,null,null,null,null,{"$f":"SEARCH(MASTER_EN!$AA$13,C:C)","v":{"$error":"#VALUE!"}}]
[null,null,null,null,null,null,{"$f":"SEARCH(MASTER_EN!$AA$13,C:C)","v":{"$error":"#VALUE!"}}]
[null,null,null,null,null,null,{"$f":"SEARCH(MASTER_EN!$AA$13,C:C)","v":{"$error":"#VALUE!"}}]
[null,null,null,null,null,null,{"$f":"SEARCH(MASTER_EN!$AA$13,C:C)","v":{"$error":"#VALUE!"}}]
[null,null,null,null,null,null,{"$f":"SEARCH(MASTER_EN!$AA$13,C:C)","v":{"$error":"#VALUE!"}}]
[null,null,null,null,null,null,{"$f":"SEARCH(MASTER_EN!$AA$13,C:C)","v":{"$error":"#VALUE!"}}]
[null,null,null,null,null,null,{"$f":"SEARCH(MASTER_EN!$AA$13,C:C)","v":{"$error":"#VALUE!"}}]
[null,null,null,null,null,null,{"$f":"SEARCH(MASTER_EN!$AA$13,C:C)","v":{"$error":"#VALUE!"}}]
[null,null,null,null,null,null,{"$f":"SEARCH(MASTER_EN!$AA$13,C:C)","v":{"$error":"#VALUE!"}}]
[null,null,null,null,null,null,{"$f":"SEARCH(MASTER_EN!$AA$13,C:C)","v":{"$error":"#VALUE!"}}]
[null,null,null,null,null,null,{"$f":"SEARCH(MASTER_EN!$AA$13,C:C)","v":{"$error":"#VALUE!"}}]
[null,null,null,null,null,null,{"$f":"SEARCH(MASTER_EN!$AA$13,C:C)","v":{"$error":"#VALUE!"}}]
[null,null,null,null,null,null,{"$f":"SEARCH(MASTER_EN!$AA$13,C:C)","v":{"$error":"#VALUE!"}}]
[null,null,null,null,null,null,{"$f":"SEARCH(MASTER_EN!$AA$13,C:C)","v":{"$error":"#VALUE!"}}]
[null,null,null,null,null,null,{"$f":"SEARCH(MASTER_EN!$AA$13,C:C)","v":{"$error":"#VALUE!"}}]
[null,null,null,null,null,null,{"$f":"SEARCH(MASTER_EN!$AA$13,C:C)","v":{"$error":"#VALUE!"}}]
[null,null,null,null,null,null,{"$f":"SEARCH(MASTER_EN!$AA$13,C:C)","v":{"$error":"#VALUE!"}}]
[null,null,null,null,null,null,{"$f":"SEARCH(MASTER_EN!$AA$13,C:C)","v":{"$error":"#VALUE!"}}]
[null,null,null,null,null,null,{"$f":"SEARCH(MASTER_EN!$AA$13,C:C)","v":{"$error":"#VALUE!"}}]
[null,null,null,null,null,null,{"$f":"SEARCH(MASTER_EN!$AA$13,C:C)","v":{"$error":"#VALUE!"}}]
[null,null,null,null,null,null,{"$f":"SEARCH(MASTER_EN!$AA$13,C:C)","v":{"$error":"#VALUE!"}}]
[null,null,null,null,null,null,{"$f":"SEARCH(MASTER_EN!$AA$13,C:C)","v":{"$error":"#VALUE!"}}]
[null,null,null,null,null,null,{"$f":"SEARCH(MASTER_EN!$AA$13,C:C)","v":{"$error":"#VALUE!"}}]
[null,null,null,null,null,null,{"$f":"SEARCH(MASTER_EN!$AA$13,C:C)","v":{"$error":"#VALUE!"}}]
[null,null,null,null,null,null,{"$f":"SEARCH(MASTER_EN!$AA$13,C:C)","v":{"$error":"#VALUE!"}}]
[null,null,null,null,null,null,{"$f":"SEARCH(MASTER_EN!$AA$13,C:C)","v":{"$error":"#VALUE!"}}]
[null,null,null,null,null,null,{"$f":"SEARCH(MASTER_EN!$AA$13,C:C)","v":{"$error":"#VALUE!"}}]
[null,null,null,null,null,null,{"$f":"SEARCH(MASTER_EN!$AA$13,C:C)","v":{"$error":"#VALUE!"}}]
[null,null,null,null,null,null,{"$f":"SEARCH(MASTER_EN!$AA$13,C:C)","v":{"$error":"#VALUE!"}}]
[null,null,null,null,null,null,{"$f":"SEARCH(MASTER_EN!$AA$13,C:C)","v":{"$error":"#VALUE!"}}]
[null,null,null,null,null,null,{"$f":"SEARCH(MASTER_EN!$AA$13,C:C)","v":{"$error":"#VALUE!"}}]
[null,null,null,null,null,null,{"$f":"SEARCH(MASTER_EN!$AA$13,C:C)","v":{"$error":"#VALUE!"}}]
[null,null,null,null,null,null,{"$f":"SEARCH(MASTER_EN!$AA$13,C:C)","v":{"$error":"#VALUE!"}}]
[null,null,null,null,null,null,{"$f":"SEARCH(MASTER_EN!$AA$13,C:C)","v":{"$error":"#VALUE!"}}]
[null,null,null,null,null,null,{"$f":"SEARCH(MASTER_EN!$AA$13,C:C)","v":{"$error":"#VALUE!"}}]
[null,null,null,null,null,null,{"$f":"SEARCH(MASTER_EN!$AA$13,C:C)","v":{"$error":"#VALUE!"}}]
[null,null,null,null,null,null,{"$f":"SEARCH(MASTER_EN!$AA$13,C:C)","v":{"$error":"#VALUE!"}}]
[null,null,null,null,null,null,{"$f":"SEARCH(MASTER_EN!$AA$13,C:C)","v":{"$error":"#VALUE!"}}]
[null,null,null,null,null,null,{"$f":"SEARCH(MASTER_EN!$AA$13,C:C)","v":{"$error":"#VALUE!"}}]
[null,null,null,null,null,null,{"$f":"SEARCH(MASTER_EN!$AA$13,C:C)","v":{"$error":"#VALUE!"}}]
[null,null,null,null,null,null,{"$f":"SEARCH(MASTER_EN!$AA$13,C:C)","v":{"$error":"#VALUE!"}}]
[null,null,null,null,null,null,{"$f":"SEARCH(MASTER_EN!$AA$13,C:C)","v":{"$error":"#VALUE!"}}]
[null,null,null,null,null,null,{"$f":"SEARCH(MASTER_EN!$AA$13,C:C)","v":{"$error":"#VALUE!"}}]
[null,null,null,null,null,null,{"$f":"SEARCH(MASTER_EN!$AA$13,C:C)","v":{"$error":"#VALUE!"}}]
[null,null,null,null,null,null,{"$f":"SEARCH(MASTER_EN!$AA$13,C:C)","v":{"$error":"#VALUE!"}}]
[null,null,null,null,null,null,{"$f":"SEARCH(MASTER_EN!$AA$13,C:C)","v":{"$error":"#VALUE!"}}]
[null,null,null,null,null,null,{"$f":"SEARCH(MASTER_EN!$AA$13,C:C)","v":{"$error":"#VALUE!"}}]
[null,null,null,null,null,null,{"$f":"SEARCH(MASTER_EN!$AA$13,C:C)","v":{"$error":"#VALUE!"}}]