{"text_format":"1","workbook":"xlsx","n_sheets":3,"sheets":["MASTER_EN","LIST","PARTS"],"not_rendered":{"charts":0,"images":0,"macros":1,"external_links":0,"defined_names":2,"comments":0,"pivot_tables":0},"unopened":[],"bounds":{"document_bytes":16777216,"sheet_cells":100000,"rows_first":2000,"rows_last":500,"rows_between":2000,"halvings":0,"cell_chars":16384,"cell_head_chars":4096},"cells_cut":0,"cells_raw":0,"read":"whole","date_system":"1900"}

{"sheet":"MASTER_EN","index":0,"n_rows":204,"n_cols":31,"rows_kept":204,"cut":false,"hidden":false,"merged":[[9,27,9,28],[122,6,122,11],[114,6,114,11],[7,6,7,11],[8,18,8,19],[9,18,9,19],[16,6,16,11],[21,6,21,11],[30,6,30,11],[52,6,52,11],[71,6,71,11],[84,6,84,11],[99,6,99,11],[107,6,107,11]]}
[null,null,null,null,null,null,null,null,null,null,null,null,null,null,null,null,null,null,null,null,null,null,null,null,"²"]
[null,null,null,null,null,null,null,null,null,null,null,null,null,null,null,null,null,"DATE REPAIR"]
[null,null,null,null,null,null,null,null,null,null,null,null,null,null,null,null,null,"INFO BIKE"]
[null,null,null,null,null,null,null,null,null,null,null,null,null,null,null,null,null,"BIN / FRAME N°"]
[null,null,null,null,null,null,null,null,null,null,null,null,null,null,null,null,null,"CLIENT NAME"]
[]
[null,null,null,null,null,null,null,null,null,null,null,null,null,null,null,null,null,null,null,null,null,null,null,null,null,null,null,"PRICE FOR","SP"]
[null,"1WU =",6,"min",null,null,"A. SUBMITTING THE BIKE FOR SERVICE",null,null,null,null,null,null,null,null,null,null,"OVERVIEW LABOR COST",null,null,null,null,null,null,null,"SPARE PARTS COST",null,"VAT RATE %"]
[null,"1WU COST =",7,null,null,"Lp","CODE","SERVICE WORK","REMARKS","VALUE","WU","WORK PERFORMED",null,null,null,null,null,null,"WORKING TIME",null,{"$f":"SUM(U13:U137)&\"AW\"","v":"11AW"},null,null,null,null,null,null,null,null,"NET","GROSS"]
[null,null,null,null,null,{"$f":"IF(L10=\"X\",MAX($F$9:F9)+1,\"\")","v":""},"A010","Unpacking the bike",null,1,1,null,null,null,null,null,null,null,"NET COST",null,{"$f":"SUM(V13:V135)","v":77},null,null,null,null,null,null,"TOTAL COST",null,{"$f":"SUM(AD13:AD90)","v":0},{"$f":"SUM(AE13:AE121)","v":0}]
[null,null,null,null,null,{"$f":"IF(L11=\"X\",MAX($F$9:F10)+1,\"\")","v":""},"A020","List of supplied accessories",null,1,0.5]
[null,null,null,null,null,{"$f":"IF(L12=\"X\",MAX($F$9:F11)+1,\"\")","v":1},"A030","Inspection and determination of the technical condition of the bicycle",null,1,1,"x",null,null,null,"No.","CODE","SERVICE WORK","REMARKS","VALUE","WU","PRICE",null,null,null,"No.","ARTICLE","STOCK CODE","QTY","NET","GROSS"]
[null,null,null,null,null,{"$f":"IF(L13=\"X\",MAX($F$9:F12)+1,\"\")","v":""},"A040","Photo documentation",null,1,1,null,null,{"$f":"IF(P13=1,\"s\",\"\")","v":"s"},1,{"$f":"_xlfn.IFNA(VLOOKUP($O13,F:F,1,0),\"\")","v":1},{"$f":"_xlfn.IFNA(VLOOKUP($O13,$F:$K,2,0),\"\")","v":"A030"},{"$f":"_xlfn.IFNA(VLOOKUP($O13,F:L,3,0),\"\")","v":"Inspection and determination of the technical condition of the bicycle"},{"$f":"_xlfn.IFNA(IF(ISBLANK(VLOOKUP($O13,$F:$K,4,0)),\"\",VLOOKUP($O13,$F:$K,4,0)),\"\")","v":""},{"$f":"_xlfn.IFNA(IF(ISBLANK(VLOOKUP($O13,$F:$K,5,0)),\"\",VLOOKUP($O13,$F:$K,5,0)),\"\")","v":1},{"$f":"_xlfn.IFNA(IF(P13=\"\",\"\",IF(S13=\"DW\",VLOOKUP(T13,LIST!$A$2:$B$5,2,0)+VLOOKUP($P13,$F:$K,6,0),VLOOKUP($P13,$F:$K,6,0)*T13)),\"\")","v":1},{"$f":"IF(U13=\"\",\"\",U13*$C$9)","v":7},null,null,{"$f":"IF(Z13=1,\"s\",\"\")","v":"s"},{"$f":"IF(ISBLANK(AA13),\"\",1)","v":1},"PLEASE CHOOSE",{"$f":"IF(ISBLANK(AA13),\"\",VLOOKUP($AA13,PARTS!$C:$F,2,0))","v":0},null,{"$f":"IF(ISBLANK(AA13),\"\",IF($AC$7=\"SP\",VLOOKUP($AA13,PARTS!$C:$F,3,0),VLOOKUP($AA13,PARTS!$C:$F,4,0)))","v":0},{"$f":"IF(ISBLANK(AA13),\"\",AC13*AD13*(1+$AC$8))","v":0}]
[null,null,null,null,null,{"$f":"IF(L14=\"X\",MAX($F$9:F13)+1,\"\")","v":2},"A050","Checking system parameters using software",null,1,1,"x",null,{"$f":"IF(P14=\"\",\"\",IF(N13=\"s\",\"z\",\"s\"))","v":"z"},2,2,"A050","Checking system parameters using software",{"$f":"_xlfn.IFNA(IF(ISBLANK(VLOOKUP($O14,$F:$K,4,0)),\"\",VLOOKUP($O14,$F:$K,4,0)),\"\")","v":""},1,{"$f":"_xlfn.IFNA(IF(P14=\"\",\"\",IF(S14=\"DW\",VLOOKUP(T14,LIST!$A$2:$B$5,2,0)+VLOOKUP($P14,$F:$K,6,0),VLOOKUP($P14,$F:$K,6,0)*T14)),\"\")","v":1},7,null,null,{"$f":"IF(Z14=\"\",\"\",IF(Y13=\"s\",\"z\",\"s\"))","v":"z"},{"$f":"IF(ISBLANK(AA14),\"\",MAX($Z13:Z$13)+1)","v":2},"PLEASE CHOOSE",{"$f":"IF(ISBLANK(AA14),\"\",VLOOKUP($AA14,PARTS!$C:$F,2,0))","v":0},null,{"$f":"IF(ISBLANK(AA14),\"\",IF($AC$7=\"SP\",VLOOKUP($AA14,PARTS!$C:$F,3,0),VLOOKUP($AA14,PARTS!$C:$F,4,0)))","v":0},{"$f":"IF(ISBLANK(AA14),\"\",AC14*AD14*(1+$AC$8))","v":0}]
[null,null,null,null,null,{"$f":"IF(L15=\"X\",MAX($F$9:F14)+1,\"\")","v":3},"A060","Test ride","BASIC",{"$f":"IF(I15=\"\",\"\",VLOOKUP(I15,LIST!$N$2:$O$3,2,0)+1)","v":1},1,"x",null,{"$f":"IF(P15=\"\",\"\",IF(N14=\"s\",\"z\",\"s\"))","v":"s"},3,3,"A060","Test ride","BASIC",1,{"$f":"_xlfn.IFNA(IF(P15=\"\",\"\",IF(S15=\"DW\",VLOOKUP(T15,LIST!$A$2:$B$5,2,0)+VLOOKUP($P15,$F:$K,6,0),VLOOKUP($P15,$F:$K,6,0)*T15)),\"\")","v":1},7,null,null,{"$f":"IF(Z15=\"\",\"\",IF(Y14=\"s\",\"z\",\"s\"))","v":"s"},{"$f":"IF(ISBLANK(AA15),\"\",MAX($Z$13:Z14)+1)","v":3},"PLEASE CHOOSE",{"$f":"IF(ISBLANK(AA15),\"\",VLOOKUP($AA15,PARTS!$C:$F,2,0))","v":0},null,{"$f":"IF(ISBLANK(AA15),\"\",IF($AC$7=\"SP\",VLOOKUP($AA15,PARTS!$C:$F,3,0),VLOOKUP($AA15,PARTS!$C:$F,4,0)))","v":0},0]
[null,null,null,null,null,{"$f":"IF(L16=\"X\",MAX($F$9:F15)+1,\"\")","v":""},"A070","Service support",null,1,1,null,null,{"$f":"IF(P16=\"\",\"\",IF(N15=\"s\",\"z\",\"s\"))","v":"z"},4,4,"B010","Test ride after service","BASIC",1,{"$f":"_xlfn.IFNA(IF(P16=\"\",\"\",IF(S16=\"DW\",VLOOKUP(T16,LIST!$A$2:$B$5,2,0)+VLOOKUP($P16,$F:$K,6,0),VLOOKUP($P16,$F:$K,6,0)*T16)),\"\")","v":1},7,null,null,"z",{"$f":"IF(ISBLANK(AA16),\"\",MAX($Z$13:Z15)+1)","v":4},"PLEASE CHOOSE",{"$f":"IF(ISBLANK(AA16),\"\",VLOOKUP($AA16,PARTS!$C:$F,2,0))","v":0},null,{"$f":"IF(ISBLANK(AA16),\"\",IF($AC$7=\"SP\",VLOOKUP($AA16,PARTS!$C:$F,3,0),VLOOKUP($AA16,PARTS!$C:$F,4,0)))","v":0},0]
[null,null,null,null,null,{"$f":"IF(L17=\"X\",MAX($F$9:F16)+1,\"\")","v":""},"B. PREPARING THE BIKE FOR DELIVERY TO THE CUSTOMER",null,null,null,null,null,null,"s",5,5,"J010","Controller replacement","QTY",1,{"$f":"_xlfn.IFNA(IF(P17=\"\",\"\",IF(S17=\"DW\",VLOOKUP(T17,LIST!$A$2:$B$5,2,0)+VLOOKUP($P17,$F:$K,6,0),VLOOKUP($P17,$F:$K,6,0)*T17)),\"\")","v":7},49,null,null,"s",{"$f":"IF(ISBLANK(AA17),\"\",MAX($Z$13:Z16)+1)","v":5},"PLEASE CHOOSE",{"$f":"IF(ISBLANK(AA17),\"\",VLOOKUP($AA17,PARTS!$C:$F,2,0))","v":0},null,{"$f":"IF(ISBLANK(AA17),\"\",IF($AC$7=\"SP\",VLOOKUP($AA17,PARTS!$C:$F,3,0),VLOOKUP($AA17,PARTS!$C:$F,4,0)))","v":0},0]
[null,null,null,null,null,{"$f":"IF(L18=\"X\",MAX($F$9:F17)+1,\"\")","v":""},"CODE","SERVICE WORK","REMARKS","VALUE","WU","WORK PERFORMED",null,"",6,"","","","","",{"$f":"_xlfn.IFNA(IF(P18=\"\",\"\",IF(S18=\"DW\",VLOOKUP(T18,LIST!$A$2:$B$5,2,0)+VLOOKUP($P18,$F:$K,6,0),VLOOKUP($P18,$F:$K,6,0)*T18)),\"\")","v":""},"",null,null,"z",{"$f":"IF(ISBLANK(AA18),\"\",MAX($Z$13:Z17)+1)","v":6},"PLEASE CHOOSE",{"$f":"IF(ISBLANK(AA18),\"\",VLOOKUP($AA18,PARTS!$C:$F,2,0))","v":0},null,{"$f":"IF(ISBLANK(AA18),\"\",IF($AC$7=\"SP\",VLOOKUP($AA18,PARTS!$C:$F,3,0),VLOOKUP($AA18,PARTS!$C:$F,4,0)))","v":0},0]
[null,null,null,null,null,{"$f":"IF(L19=\"X\",MAX($F$9:F18)+1,\"\")","v":4},"B010","Test ride after service","BASIC",{"$f":"IF(I19=\"\",\"\",VLOOKUP(I19,LIST!$N$2:$O$3,2,0)+1)","v":1},1,"x",null,"",7,"","","","","",{"$f":"_xlfn.IFNA(IF(P19=\"\",\"\",IF(S19=\"DW\",VLOOKUP(T19,LIST!$A$2:$B$5,2,0)+VLOOKUP($P19,$F:$K,6,0),VLOOKUP($P19,$F:$K,6,0)*T19)),\"\")","v":""},"",null,null,"s",{"$f":"IF(ISBLANK(AA19),\"\",MAX($Z$13:Z18)+1)","v":7},"PLEASE CHOOSE",{"$f":"IF(ISBLANK(AA19),\"\",VLOOKUP($AA19,PARTS!$C:$F,2,0))","v":0},null,{"$f":"IF(ISBLANK(AA19),\"\",IF($AC$7=\"SP\",VLOOKUP($AA19,PARTS!$C:$F,3,0),VLOOKUP($AA19,PARTS!$C:$F,4,0)))","v":0},0]
[null,null,null,null,null,{"$f":"IF(L20=\"X\",MAX($F$9:F19)+1,\"\")","v":""},"B020","Cleaning","BASIC",{"$f":"IF(I20=\"\",\"\",VLOOKUP(I20,LIST!$K$2:$L$4,2,0)+1)","v":1},1,null,null,{"$f":"IF(P20=\"\",\"\",IF(N19=\"s\",\"z\",\"s\"))","v":""},8,"","","","","",{"$f":"_xlfn.IFNA(IF(P20=\"\",\"\",IF(S20=\"DW\",VLOOKUP(T20,LIST!$A$2:$B$5,2,0)+VLOOKUP($P20,$F:$K,6,0),VLOOKUP($P20,$F:$K,6,0)*T20)),\"\")","v":""},"",null,null,"z",{"$f":"IF(ISBLANK(AA20),\"\",MAX($Z$13:Z19)+1)","v":8},"PLEASE CHOOSE",{"$f":"IF(ISBLANK(AA20),\"\",VLOOKUP($AA20,PARTS!$C:$F,2,0))","v":0},null,{"$f":"IF(ISBLANK(AA20),\"\",IF($AC$7=\"SP\",VLOOKUP($AA20,PARTS!$C:$F,3,0),VLOOKUP($AA20,PARTS!$C:$F,4,0)))","v":0},0]
[null,null,null,null,null,{"$f":"IF(L21=\"X\",MAX($F$9:F20)+1,\"\")","v":""},"B030","Packing the bike",null,1,2,null,null,{"$f":"IF(P21=\"\",\"\",IF(N20=\"s\",\"z\",\"s\"))","v":""},9,"","","","","",{"$f":"_xlfn.IFNA(IF(P21=\"\",\"\",IF(S21=\"DW\",VLOOKUP(T21,LIST!$A$2:$B$5,2,0)+VLOOKUP($P21,$F:$K,6,0),VLOOKUP($P21,$F:$K,6,0)*T21)),\"\")","v":""},"",null,null,"s",{"$f":"IF(ISBLANK(AA21),\"\",MAX($Z$13:Z20)+1)","v":9},"PLEASE CHOOSE",{"$f":"IF(ISBLANK(AA21),\"\",VLOOKUP($AA21,PARTS!$C:$F,2,0))","v":0},null,{"$f":"IF(ISBLANK(AA21),\"\",IF($AC$7=\"SP\",VLOOKUP($AA21,PARTS!$C:$F,3,0),VLOOKUP($AA21,PARTS!$C:$F,4,0)))","v":0},0]
[null,null,null,null,null,{"$f":"IF(L22=\"X\",MAX($F$9:F21)+1,\"\")","v":""},"C. BIKE EQUIPMENT",null,null,null,null,null,null,"",10,"","","","","",{"$f":"_xlfn.IFNA(IF(P22=\"\",\"\",IF(S22=\"DW\",VLOOKUP(T22,LIST!$A$2:$B$5,2,0)+VLOOKUP($P22,$F:$K,6,0),VLOOKUP($P22,$F:$K,6,0)*T22)),\"\")","v":""},"",null,null,"z",{"$f":"IF(ISBLANK(AA22),\"\",MAX($Z$13:Z21)+1)","v":10},"PLEASE CHOOSE",{"$f":"IF(ISBLANK(AA22),\"\",VLOOKUP($AA22,PARTS!$C:$F,2,0))","v":0},null,{"$f":"IF(ISBLANK(AA22),\"\",IF($AC$7=\"SP\",VLOOKUP($AA22,PARTS!$C:$F,3,0),VLOOKUP($AA22,PARTS!$C:$F,4,0)))","v":0},0]
[null,null,null,null,null,{"$f":"IF(L23=\"X\",MAX($F$9:F22)+1,\"\")","v":""},"CODE","SERVICE WORK","REMARKS","VALUE","WU","WORK PERFORMED",null,{"$f":"IF(P23=\"\",\"\",IF(N22=\"s\",\"z\",\"s\"))","v":""},11,"","","","","",{"$f":"_xlfn.IFNA(IF(P23=\"\",\"\",IF(S23=\"DW\",VLOOKUP(T23,LIST!$A$2:$B$5,2,0)+VLOOKUP($P23,$F:$K,6,0),VLOOKUP($P23,$F:$K,6,0)*T23)),\"\")","v":""},"",null,null,"s",{"$f":"IF(ISBLANK(AA23),\"\",MAX($Z$13:Z22)+1)","v":11},"PLEASE CHOOSE",{"$f":"IF(ISBLANK(AA23),\"\",VLOOKUP($AA23,PARTS!$C:$F,2,0))","v":0},null,{"$f":"IF(ISBLANK(AA23),\"\",IF($AC$7=\"SP\",VLOOKUP($AA23,PARTS!$C:$F,3,0),VLOOKUP($AA23,PARTS!$C:$F,4,0)))","v":0},0]
[null,null,null,null,null,{"$f":"IF(L24=\"X\",MAX($F$9:F23)+1,\"\")","v":""},"C010","Rear carrier replacement",null,1,4,null,null,{"$f":"IF(P24=\"\",\"\",IF(N23=\"s\",\"z\",\"s\"))","v":""},12,"","","","","",{"$f":"_xlfn.IFNA(IF(P24=\"\",\"\",IF(S24=\"DW\",VLOOKUP(T24,LIST!$A$2:$B$5,2,0)+VLOOKUP($P24,$F:$K,6,0),VLOOKUP($P24,$F:$K,6,0)*T24)),\"\")","v":""},"",null,null,"z",{"$f":"IF(ISBLANK(AA24),\"\",MAX($Z$13:Z23)+1)","v":12},"PLEASE CHOOSE",{"$f":"IF(ISBLANK(AA24),\"\",VLOOKUP($AA24,PARTS!$C:$F,2,0))","v":0},null,{"$f":"IF(ISBLANK(AA24),\"\",IF($AC$7=\"SP\",VLOOKUP($AA24,PARTS!$C:$F,3,0),VLOOKUP($AA24,PARTS!$C:$F,4,0)))","v":0},0]
[null,null,null,null,null,{"$f":"IF(L25=\"X\",MAX($F$9:F24)+1,\"\")","v":""},"C020","Kickstand replacement",null,1,1,null,null,"",13,"","","","","",{"$f":"_xlfn.IFNA(IF(P25=\"\",\"\",IF(S25=\"DW\",VLOOKUP(T25,LIST!$A$2:$B$5,2,0)+VLOOKUP($P25,$F:$K,6,0),VLOOKUP($P25,$F:$K,6,0)*T25)),\"\")","v":""},"",null,null,"s",{"$f":"IF(ISBLANK(AA25),\"\",MAX($Z$13:Z24)+1)","v":13},"PLEASE CHOOSE",{"$f":"IF(ISBLANK(AA25),\"\",VLOOKUP($AA25,PARTS!$C:$F,2,0))","v":0},null,{"$f":"IF(ISBLANK(AA25),\"\",IF($AC$7=\"SP\",VLOOKUP($AA25,PARTS!$C:$F,3,0),VLOOKUP($AA25,PARTS!$C:$F,4,0)))","v":0},0]
[null,null,null,null,null,{"$f":"IF(L26=\"X\",MAX($F$9:F25)+1,\"\")","v":""},"C030","Front fender replacement",null,1,2,null,null,"",14,"","","","","",{"$f":"_xlfn.IFNA(IF(P26=\"\",\"\",IF(S26=\"DW\",VLOOKUP(T26,LIST!$A$2:$B$5,2,0)+VLOOKUP($P26,$F:$K,6,0),VLOOKUP($P26,$F:$K,6,0)*T26)),\"\")","v":""},"",null,null,"z",{"$f":"IF(ISBLANK(AA26),\"\",MAX($Z$13:Z25)+1)","v":14},"PLEASE CHOOSE",{"$f":"IF(ISBLANK(AA26),\"\",VLOOKUP($AA26,PARTS!$C:$F,2,0))","v":0},null,{"$f":"IF(ISBLANK(AA26),\"\",IF($AC$7=\"SP\",VLOOKUP($AA26,PARTS!$C:$F,3,0),VLOOKUP($AA26,PARTS!$C:$F,4,0)))","v":0},0]
[null,null,null,null,null,{"$f":"IF(L27=\"X\",MAX($F$9:F26)+1,\"\")","v":""},"C040","Rear fender replacement",null,1,6,null,null,"",15,"","","","","",{"$f":"_xlfn.IFNA(IF(P27=\"\",\"\",IF(S27=\"DW\",VLOOKUP(T27,LIST!$A$2:$B$5,2,0)+VLOOKUP($P27,$F:$K,6,0),VLOOKUP($P27,$F:$K,6,0)*T27)),\"\")","v":""},"",null,null,"s",{"$f":"IF(ISBLANK(AA27),\"\",MAX($Z$13:Z26)+1)","v":15},"PLEASE CHOOSE",{"$f":"IF(ISBLANK(AA27),\"\",VLOOKUP($AA27,PARTS!$C:$F,2,0))","v":0},null,{"$f":"IF(ISBLANK(AA27),\"\",IF($AC$7=\"SP\",VLOOKUP($AA27,PARTS!$C:$F,3,0),VLOOKUP($AA27,PARTS!$C:$F,4,0)))","v":0},0]
[null,null,null,null,null,{"$f":"IF(L28=\"X\",MAX($F$9:F27)+1,\"\")","v":""},"C050","Front light replacement","DW",1,2,null,null,"",16,"","","","","",{"$f":"_xlfn.IFNA(IF(P28=\"\",\"\",IF(S28=\"DW\",VLOOKUP(T28,LIST!$A$2:$B$5,2,0)+VLOOKUP($P28,$F:$K,6,0),VLOOKUP($P28,$F:$K,6,0)*T28)),\"\")","v":""},"",null,null,"z",{"$f":"IF(ISBLANK(AA28),\"\",MAX($Z$13:Z27)+1)","v":16},"PLEASE CHOOSE",{"$f":"IF(ISBLANK(AA28),\"\",VLOOKUP($AA28,PARTS!$C:$F,2,0))","v":0},null,{"$f":"IF(ISBLANK(AA28),\"\",IF($AC$7=\"SP\",VLOOKUP($AA28,PARTS!$C:$F,3,0),VLOOKUP($AA28,PARTS!$C:$F,4,0)))","v":0},0]
[null,null,null,null,null,{"$f":"IF(L29=\"X\",MAX($F$9:F28)+1,\"\")","v":""},"C060","Rear light replacement",null,1,2.5,null,null,"",17,"","","","","",{"$f":"_xlfn.IFNA(IF(P29=\"\",\"\",IF(S29=\"DW\",VLOOKUP(T29,LIST!$A$2:$B$5,2,0)+VLOOKUP($P29,$F:$K,6,0),VLOOKUP($P29,$F:$K,6,0)*T29)),\"\")","v":""},"",null,null,"s",{"$f":"IF(ISBLANK(AA29),\"\",MAX($Z$13:Z28)+1)","v":17},"PLEASE CHOOSE",{"$f":"IF(ISBLANK(AA29),\"\",VLOOKUP($AA29,PARTS!$C:$F,2,0))","v":0},null,{"$f":"IF(ISBLANK(AA29),\"\",IF($AC$7=\"SP\",VLOOKUP($AA29,PARTS!$C:$F,3,0),VLOOKUP($AA29,PARTS!$C:$F,4,0)))","v":0},0]
[null,null,null,null,null,{"$f":"IF(L30=\"X\",MAX($F$9:F29)+1,\"\")","v":""},"C070","Pedal replacement",null,1,1,null,null,"",18,"","","","","",{"$f":"_xlfn.IFNA(IF(P30=\"\",\"\",IF(S30=\"DW\",VLOOKUP(T30,LIST!$A$2:$B$5,2,0)+VLOOKUP($P30,$F:$K,6,0),VLOOKUP($P30,$F:$K,6,0)*T30)),\"\")","v":""},"",{"$f":"IF(Y30=\"\",\"\",IF(Y29=\"s\",\"z\",\"s\"))","v":""},null,{"$f":"IF(ISBLANK(Z30),\"\",MAX($Z$13:Z29)+1)","v":""},null,null,{"$f":"IF(ISBLANK(AA30),\"\",VLOOKUP($AA30,PARTS!$C:$F,2,0))","v":""},null,{"$f":"IF(ISBLANK(AA30),\"\",IF($AC$7=\"SP\",VLOOKUP($AA30,PARTS!$C:$F,3,0),VLOOKUP($AA30,PARTS!$C:$F,4,0)))","v":""}]
{"$rows_left_out":175}
{"sheet":"LIST","index":1,"n_rows":39,"n_cols":18,"rows_kept":39,"cut":false,"hidden":true,"merged":[]}
["DW","WU",null,"QTY",null,null,"QTY",null,0.5,null,"cleanliness","AT",null,"Test ride"]
[1,null,null,1,null,null,"DW",null,0.75,null,"BASIC",0,null,"BASIC",0,null,null,"SP"]
[2,2,null,2,null,null,null,null,1,null,"DIRTY",3,null,"LONG",4,null,null,"CUSTOMER"]
[3,3,null,3,null,null,null,null,1.25,null,"VERY DIRTY",6]
[4,4,null,4,null,null,null,null,1.5]
[null,null,null,5,null,null,null,null,1.75]
[null,null,null,6,null,null,null,null,2]
[null,null,null,7,null,null,null,null,2.25]
[null,null,null,8,null,null,null,null,2.5]
[null,null,null,9,null,null,null,null,2.75]
[null,null,null,10,null,null,null,null,3]
[null,null,null,null,null,null,null,null,3.25]
[null,null,null,null,null,null,null,null,3.5]
[null,null,null,null,null,null,null,null,3.75]
[null,null,null,null,null,null,null,null,4]
[null,null,null,null,null,null,null,null,4.25]
[null,null,null,null,null,null,null,null,4.5]
[null,null,null,null,null,null,null,null,4.75]
[null,null,null,null,null,null,null,null,5]
[null,null,null,null,null,null,null,null,5.25]
[null,null,null,null,null,null,null,null,5.5]
[null,null,null,null,null,null,null,null,5.75]
[null,null,null,null,null,null,null,null,6]
[null,null,null,null,null,null,null,null,6.25]
[null,null,null,null,null,null,null,null,6.5]
[null,null,null,null,null,null,null,null,6.75]
[null,null,null,null,null,null,null,null,7]
[null,null,null,null,null,null,null,null,7.25]
[null,null,null,null,null,null,null,null,7.5]
[null,null,null,null,null,null,null,null,7.75]
{"$rows_left_out":10}
{"sheet":"PARTS","index":2,"n_rows":252,"n_cols":9,"rows_kept":252,"cut":false,"hidden":true,"merged":[]}
["Nazwa","Opis","ENG","Kod","2023       SP Price Excl VAT","2023 Client price  Excl VAT","Search","IsNumber","Filter"]
[null,null,"PLEASE CHOOSE",null,null,null,{"$f":"SEARCH(MASTER_EN!$AA$13,C:C)","v":1}]
["KLUCZ PŁASKO OCZKOWY 15MM","15MM","15MM SPANNER","KLPO000001",2.4,3.4,{"$f":"SEARCH(MASTER_EN!AA13,C:C)","v":{"$error":"#VALUE!"}}]
["KLUCZ IMBUSOWY  4MM","4MM","4MM ALLEN SPANNER","KLIM000001",0.35,0.5,{"$f":"SEARCH(MASTER_EN!$AA$13,C:C)","v":{"$error":"#VALUE!"}}]
["KLUCZ IMBUSOWY 5MM","5MM","5MM ALLEN SPANNER","KLIM000002",0.7,1,{"$f":"SEARCH(MASTER_EN!$AA$13,C:C)","v":{"$error":"#VALUE!"}}]
["KARTON NA AKCESORIA","KARTON- PUDEŁKO NA AKCESORIA- KLUCZE H-40","ACCESSORIES BOX","KART000005",0.6,0.8,{"$f":"SEARCH(MASTER_EN!$AA$13,C:C)","v":{"$error":"#VALUE!"}}]
["WSPORNIK KIEROWNICY REGULOWANY BRU/LON","ADJUSTABLE STEM DIE CASTING ALLOY FI31,8MM EXT90","ADJUSTABLE STEM BRU/LON","WSKI000007",19.899999999999999,27.9,{"$f":"SEARCH(MASTER_EN!$AA$13,C:C)","v":{"$error":"#VALUE!"}}]
["WSPORNIK KIEROWNICY REGULOWANY VIE","ADJUSTABLE STEM DIE CASTING ALLOY FI31,8MM EXT110","ADJUSTABLE STEM VIE","WSKI000008",19.579439999999998,27.411215999999996,{"$f":"SEARCH(MASTER_EN!$AA$13,C:C)","v":{"$error":"#VALUE!"}}]
["OWIJKA NA KIEROWNICĘ BER","OWIJKA KIEROWNICY EVA HANDLEBAR TAPE, W/2PC PLUGS & STICKERS, EVA FOAM, BLACK","BAR TAPE BER","OWIJ000001",5.1542400000000006,7.2159360000000001,{"$f":"SEARCH(MASTER_EN!$AA$13,C:C)","v":{"$error":"#VALUE!"}}]
["BATERIA GOTOWA 10AH","BATERIA GOTOWA 10AH","BATTERY PREPARED 10AH","BATG000001",280,392,{"$f":"SEARCH(MASTER_EN!$AA$13,C:C)","v":{"$error":"#VALUE!"}}]
["BATERIA GOTOWA 7AH","BATERIA GOTOWA 7AH","BATTERY PREPARED 7AH","BATG000002",195,273,{"$f":"SEARCH(MASTER_EN!$AA$13,C:C)","v":{"$error":"#VALUE!"}}]
["DZWONEK ROCKBROS 2023","BLACK ROCKBROS15-1B","BELL ROCKBROS 2023","DZWO000005",5.5,7.6999999999999993,{"$f":"SEARCH(MASTER_EN!$AA$13,C:C)","v":{"$error":"#VALUE!"}}]
["PASEK 115T AMS","CDX BELT GATES CARBON DRIVE 115T BLACK/BLACK","BELT 115T AMS","PASE000001",61,85.399999999999991,{"$f":"SEARCH(MASTER_EN!$AA$13,C:C)","v":{"$error":"#VALUE!"}}]
["PASEK 118T LON M54/MIL M54","11M-118T-12CT CDN BLACK BULK","BELT 118T LON M54/MIL M54","PASE000002",40,56,{"$f":"SEARCH(MASTER_EN!$AA$13,C:C)","v":{"$error":"#VALUE!"}}]
["PASEK 120T VIE/LON L57/MIL L57","11M-120T-12CT CDN BLACK BULK","BELT 120T VIE/LON L57/MIL L57","PASE000003",40,56,{"$f":"SEARCH(MASTER_EN!$AA$13,C:C)","v":{"$error":"#VALUE!"}}]
["KASETA SUPORTU 148MM/68MM","SR PA211.32.ST.C BB 68MM,150MMG6.5.5, AXLE 148MM","BOTTOM BRACKET CASSETTE 148MM/68MM ","KASS000002",130,182,{"$f":"SEARCH(MASTER_EN!$AA$13,C:C)","v":{"$error":"#VALUE!"}}]
["KASETA SUPORTU SGM 148MM/73MM","SR PA231.32.ST 148MM/73MM","BOTTOM BRACKET CASSETTE 148MM/73MM SGM ","KASS000001",110,154,{"$f":"SEARCH(MASTER_EN!$AA$13,C:C)","v":{"$error":"#VALUE!"}}]
["KARTON SPÓD 2022","KARTON DNO FEFCO 301\"5\"","BOTTOM PACKING BOX 2022","KART000006",3,4.1999999999999993,{"$f":"SEARCH(MASTER_EN!$AA$13,C:C)","v":{"$error":"#VALUE!"}}]
["ADAPTER HAMULCA 160MM","CONVERTER ROAD DISC BRAKE F BULK SM-MA-F16 P/D Ø160","BRAKE ADAPTER 160MM","ADAH000001",13.5,18.899999999999999,{"$f":"SEARCH(MASTER_EN!$AA$13,C:C)","v":{"$error":"#VALUE!"}}]
["KLOCKI HAMULCOWE","HAM SHIELDS B01S CLADDING 25PAR ZICHI","BRAKE PADS","KLHA000001",3.7,5.2,{"$f":"SEARCH(MASTER_EN!$AA$13,C:C)","v":{"$error":"#VALUE!"}}]
["PRZEWÓD GOTOWY DO WSPORNIKA SIODŁA ZE ŚWIATŁAMI","PRZEWÓD GOTOWY DO WSPORNIKA SIODŁA ZE ŚWIATŁAMI","CABLE PREPARED FOR SEATPOST WITH LIGHTS","PRZG000001",19.32,27.047999999999998,{"$f":"SEARCH(MASTER_EN!$AA$13,C:C)","v":{"$error":"#VALUE!"}}]
["WKŁADKA KARTONOWA NA SIODŁO","WKŁADKA KARTONOWA NA SIODŁO","CARDBOARD INSERT FOR SADDLE","WKLA000004",0.87216000000000016,1.2210240000000001,{"$f":"SEARCH(MASTER_EN!$AA$13,C:C)","v":{"$error":"#VALUE!"}}]
["WKŁADKA KARTONOWA NA KOŁO","WKŁADKA KARTONOWA NA KOŁO","CARDBOARD INSERT FOR WHEEL","WKLA000003",2.2576799999999997,3.1607519999999996,{"$f":"SEARCH(MASTER_EN!$AA$13,C:C)","v":{"$error":"#VALUE!"}}]
["KASETA PRZERZUTKI 9 RZĘDÓW","CASSETE SPROCKET HG400 9-SPEED 11-12-14-16-16-21-24-28-32(AR)","CASSETE SPROCKET 9-SPEED","KAPR000001",22.4,31.35,{"$f":"SEARCH(MASTER_EN!$AA$13,C:C)","v":{"$error":"#VALUE!"}}]
["ŁAŃCUCH GOLDENWHEEL","CHAIN,Z9-116 LINKS","CHAIN 9-SPEED GOLDENWHEEL","LANC000003",12.48,17.471999999999998,{"$f":"SEARCH(MASTER_EN!$AA$13,C:C)","v":{"$error":"#VALUE!"}}]
["ŁAŃCUCH 9-BIEGÓW SHIMANO","CH-HG53 9-BIEGÓW 116 LINKS","CHAIN 9-SPEED SHIMANO","LANC000001",15.8,22.1,{"$f":"SEARCH(MASTER_EN!$AA$13,C:C)","v":{"$error":"#VALUE!"}}]
["OSŁONA ŁAŃCUCHA ","OSŁONA BZEN00005_2021_REV B","CHAIN COVER","OSLA000002",15,21,{"$f":"SEARCH(MASTER_EN!$AA$13,C:C)","v":{"$error":"#VALUE!"}}]
["WTYCZKA DO ŁADOWARKI 2PIN","LP-12-C02PE-02-001","CHARGER PLUG 2PIN","WTYC000002",4.3680000000000003,6.1151999999999997,{"$f":"SEARCH(MASTER_EN!$AA$13,C:C)","v":{"$error":"#VALUE!"}}]
["WTYCZKA DO ŁADOWARKI 3PIN","CHARGER PLUG WEIPU SF12 SERIES 3 P","CHARGER PLUG 3PIN","WTYC000001",19.623599999999996,27.473039999999994,{"$f":"SEARCH(MASTER_EN!$AA$13,C:C)","v":{"$error":"#VALUE!"}}]
["ŁADOWARKA GOTOWA 2021","ŁADOWARKA GOTOWA 2021","CHARGER PREPARED 2021","LADG000003",40,56,{"$f":"SEARCH(MASTER_EN!$AA$13,C:C)","v":{"$error":"#VALUE!"}}]
{"$rows_left_out":222}